{"text_format":"1","workbook":"xlsx","n_sheets":16,"sheets":["Title sheet","Inputs","Inputs (STSA)","Inputs (LTSA)","Base case","SA","SAAbs","SAProd","SATurnover","SAHealth","SASoc","SAEff","Slider","Four-way","Four-way Prod","Four-way Turnover"],"not_rendered":{"charts":54,"images":2,"macros":1,"external_links":0,"defined_names":6,"comments":4,"pivot_tables":0},"unopened":[],"bounds":{"document_bytes":16777216,"sheet_cells":100000,"rows_first":2000,"rows_last":500,"rows_between":2000,"halvings":0,"cell_chars":16384,"cell_head_chars":4096},"cells_cut":0,"cells_raw":0,"read":"whole","date_system":"1900"}

{"sheet":"Title sheet","index":0,"n_rows":26,"n_cols":6,"rows_kept":26,"cut":false,"hidden":false,"merged":[[3,2,3,3],[6,3,8,10],[20,3,24,11],[25,3,29,11]]}
[]
[]
[]
[null,null,"XXXXXXXXXXX"]
[]
[]
[null,null,null,"Workplace health: long term sickness absence and capability for work. "]
[]
[]
[]
[]
[null,null,null,"About the model:"]
[]
[null,null,null,"Black text",null,"Indicates input cells. These can be changed as appropriate to your requirements."]
[]
{"$rows_left_out":12}
{"sheet":"Inputs","index":1,"n_rows":239,"n_cols":163,"rows_kept":239,"cut":false,"hidden":false,"merged":[[31,67,31,71],[42,67,42,71],[20,60,21,60],[20,61,21,61],[20,62,21,62],[20,63,21,63],[20,64,21,64],[43,55,44,55],[43,54,44,54],[43,53,44,53],[18,11,19,11],[3,2,3,3],[18,7,19,7],[18,8,19,8],[18,9,19,9],[18,10,19,10],[19,55,20,55],[19,54,20,54],[19,53,20,53],[31,55,32,55],[31,54,32,54],[31,53,32,53],[19,143,19,146],[19,149,19,152],[19,155,19,158],[43,57,44,57],[43,56,44,56],[19,56,20,56],[31,57,32,57],[31,56,32,56],[19,57,20,57],[31,60,31,64],[42,60,42,64],[20,71,21,71],[20,70,21,70],[20,69,21,69],[20,68,21,68],[20,67,21,67],[33,141,43,141],[45,141,55,141],[39,162,40,162],[39,161,40,161],[21,141,31,141]]}
[]
[]
[]
[]
[]
[]
[]
[]
[]
[null,null,null,null,null,null,null,null,null,null,null,null,null,null,null,null,null,null,null,null,null,null,null,null,null,null,null,null,null,null,null,null,null,null,"Slider chart",null,null,null,null,null,"Sensitivity analysis"]
[null,null,null,null,null,null,null,null,null,null,null,null,null,null,null,null,null,null,null,null,null,null,null,null,null,null,null,null,null,null,null,null,null,null,null,"LIVE","Spin button"]
[null,null,null,null,null,null,null,null,null,null,null,null,null,null,null,null,null,null,null,null,null,null,null,null,null,null,null,null,null,null,null,null,null,null,"No of employees",{"$f":"IF('Base case'!$E$126=1,Inputs!AK12,Inputs!E14)","v":30},30,null,null,null,null,null,null,"Scenario analysis - baselien absenteeism"]
[null,null,null,null,null,null,null,null,null,null,null,null,null,null,null,null,null,null,null,null,null,null,null,null,null,null,null,null,null,null,null,null,null,null,null,null,null,null,null,null,"Cost of int.",{"$f":"'Base case'!G19","v":-22063.435620000004},null,"No. of days",{"$f":"'Base case'!G19","v":-22063.435620000004}]
[null,null,null,"Number of employees",{"$f":"IF(AbsenceType=1,'Inputs (STSA)'!E14,'Inputs (LTSA)'!E14)","v":30},null,null,null,null,null,null,null,null,null,null,null,null,null,null,null,null,null,null,null,null,null,null,null,null,null,null,null,null,null,"Cost of intervention per person",{"$f":"IF('Base case'!$E$126=1,Inputs!AK14,Inputs!H17)","v":1000},200,null,null,null,0,-52063.435620000004,null,4.78,6844.8235799999966,null,null,null,null,null,null,null,"Drop down effectiveness options"]
[null,null,null,null,null,null,null,null,null,null,null,null,null,null,null,null,null,null,null,null,null,null,null,null,null,null,null,null,null,null,null,null,null,null,null,null,null,null,null,null,50,-50563.435620000004,null,7.58,1526.6155799999979,null,null,null,null,null,null,null,null,null,null,null,null,null,null,"Calculations"]
{"$rows_left_out":225}
{"sheet":"Inputs (STSA)","index":2,"n_rows":239,"n_cols":163,"rows_kept":239,"cut":false,"hidden":false,"merged":[[31,53,32,53],[3,2,3,3],[18,7,19,7],[18,8,19,8],[18,9,19,9],[18,10,19,10],[18,11,19,11],[19,53,20,53],[19,54,20,54],[19,55,20,55],[19,56,20,56],[19,57,20,57],[31,67,31,71],[31,54,32,54],[31,55,32,55],[31,56,32,56],[31,57,32,57],[19,149,19,152],[19,155,19,158],[20,60,21,60],[20,61,21,61],[20,62,21,62],[20,63,21,63],[20,64,21,64],[20,67,21,67],[20,68,21,68],[20,69,21,69],[19,143,19,146],[20,70,21,70],[20,71,21,71],[21,141,31,141],[31,60,31,64],[43,53,44,53],[43,54,44,54],[43,55,44,55],[43,56,44,56],[43,57,44,57],[45,141,55,141],[33,141,43,141],[39,161,40,161],[39,162,40,162],[42,60,42,64],[42,67,42,71]]}
[]
[]
[]
[]
[]
[]
[null,null,null,null,"Short-term sickness absence"]
[]
[]
[null,null,null,"Select number of years",null,null,"Type of sickness absence",null,null,null,null,null,null,null,null,null,null,null,null,null,null,null,null,null,null,null,null,null,null,null,null,null,null,null,"Slider chart",null,null,null,null,null,"Sensitivity analysis"]
[null,null,null,null,null,null,null,null,null,null,null,null,null,null,null,null,null,null,null,null,null,null,null,null,null,null,null,null,null,null,null,null,null,null,null,"LIVE","Spin button"]
[null,null,null,"Effectiveness input method",null,null,null,null,null,null,null,null,null,null,null,null,null,null,null,null,null,null,null,null,null,null,null,null,null,null,null,null,null,null,"No of employees",{"$f":"IF('Base case'!$E$126=1,'Inputs (STSA)'!AK12,'Inputs (STSA)'!E14)","v":30},1,null,null,null,null,null,null,"Scenario analysis - baselien absenteeism"]
[null,null,null,null,null,null,null,null,null,null,null,null,null,null,null,null,null,null,null,null,null,null,null,null,null,null,null,null,null,null,null,null,null,null,null,null,null,null,null,null,"Cost of int.",{"$f":"'Base case'!G19","v":-22063.435620000004},null,"No. of days",{"$f":"'Base case'!G19","v":-22063.435620000004}]
[null,null,null,"Number of employees",30,null,null,null,null,null,null,null,null,null,null,null,null,null,null,null,null,null,null,null,null,null,null,null,null,null,null,null,null,null,"Cost of intervention per person",{"$f":"IF('Base case'!$E$126=1,'Inputs (STSA)'!AK14,'Inputs (STSA)'!H17)","v":200},200,null,null,null,0,-22063.435620000004,null,4.78,-22063.435620000004,null,null,null,null,null,null,null,"Drop down effectiveness options"]
[null,null,null,null,null,null,null,null,null,null,null,null,null,null,null,null,null,null,null,null,null,null,null,null,null,null,null,null,null,null,null,null,null,null,null,null,null,null,null,null,50,-22063.435620000004,null,7.58,-22063.435620000004,null,null,null,null,null,null,null,null,null,null,null,null,null,null,"Calculations"]
{"$rows_left_out":225}
{"sheet":"Inputs (LTSA)","index":3,"n_rows":239,"n_cols":163,"rows_kept":239,"cut":false,"hidden":false,"merged":[[31,53,32,53],[3,2,3,3],[18,7,19,7],[18,8,19,8],[18,9,19,9],[18,10,19,10],[18,11,19,11],[19,53,20,53],[19,54,20,54],[19,55,20,55],[19,56,20,56],[19,57,20,57],[31,67,31,71],[31,54,32,54],[31,55,32,55],[31,56,32,56],[31,57,32,57],[19,149,19,152],[19,155,19,158],[20,60,21,60],[20,61,21,61],[20,62,21,62],[20,63,21,63],[20,64,21,64],[20,67,21,67],[20,68,21,68],[20,69,21,69],[19,143,19,146],[20,70,21,70],[20,71,21,71],[21,141,31,141],[31,60,31,64],[43,53,44,53],[43,54,44,54],[43,55,44,55],[43,56,44,56],[43,57,44,57],[45,141,55,141],[33,141,43,141],[39,161,40,161],[39,162,40,162],[42,60,42,64],[42,67,42,71]]}
[]
[]
[]
[]
[]
[]
[null,null,null,null,"Long-term sickness absence"]
[]
[]
[null,null,null,"Select number of years",null,null,"Type of sickness absence",null,null,null,null,null,null,null,null,null,null,null,null,null,null,null,null,null,null,null,null,null,null,null,null,null,null,null,"Slider chart",null,null,null,null,null,"Sensitivity analysis"]
[null,null,null,null,null,null,null,null,null,null,null,null,null,null,null,null,null,null,null,null,null,null,null,null,null,null,null,null,null,null,null,null,null,null,null,"LIVE","Spin button"]
[null,null,null,"Effectiveness input method",null,null,null,null,null,null,null,null,null,null,null,null,null,null,null,null,null,null,null,null,null,null,null,null,null,null,null,null,null,null,"No of employees",{"$f":"IF('Base case'!$E$126=1,'Inputs (LTSA)'!AK12,'Inputs (LTSA)'!E14)","v":30},1,null,null,null,null,null,null,"Scenario analysis - baseline absenteeism"]
[null,null,null,null,null,null,null,null,null,null,null,null,null,null,null,null,null,null,null,null,null,null,null,null,null,null,null,null,null,null,null,null,null,null,null,null,null,null,null,null,"Cost of int.",{"$f":"'Base case'!G19","v":-22063.435620000004},null,"No. of days",{"$f":"'Base case'!G19","v":-22063.435620000004}]
[null,null,null,"Number of employees",30,null,null,null,null,null,null,null,null,null,null,null,null,null,null,null,null,null,null,null,null,null,null,null,null,null,null,null,null,null,"Cost of intervention per person",{"$f":"IF('Base case'!$E$126=1,'Inputs (LTSA)'!AK14,'Inputs (LTSA)'!H17)","v":1000},200,null,null,null,0,-52063.435620000004,null,4.78,6844.8235799999966,null,null,null,null,null,null,null,"Drop down effectiveness options"]
[null,null,null,null,null,null,null,null,null,null,null,null,null,null,null,null,null,null,null,null,null,null,null,null,null,null,null,null,null,null,null,null,null,null,null,null,null,null,null,null,50,-50563.435620000004,null,7.58,1526.6155799999979,null,null,null,null,null,null,null,null,null,null,null,null,null,null,"Calculations"]
{"$rows_left_out":225}
{"sheet":"Base case","index":4,"n_rows":129,"n_cols":7,"rows_kept":129,"cut":false,"hidden":false,"merged":[[3,2,3,3],[33,3,37,7]]}
[]
[]
[]
[null,null,"XXXXXXXXXXX"]
[]
[]
[]
[]
[]
[null,null,null,"Time horizon for results",{"$f":"IF(Inputs!D130=1,\"1 year\",CONCATENATE(Inputs!D130,\" years\"))","v":"1 year"}]
[]
[null,null,null,null,"No intervention","Intervention","Incremental cost"]
[null,null,null,"Cost of absenteeism",{"$f":"CHOOSE(Inputs!$D$130,Inputs!BI45,Inputs!BJ45,Inputs!BK45,Inputs!BL45,Inputs!BM45)","v":94968},{"$f":"CHOOSE(Inputs!$D$130,Inputs!BP45,Inputs!BQ45,Inputs!BR45,Inputs!BS45,Inputs!BT45)","v":56980.799999999996},{"$f":"F13-E13","v":-37987.200000000004}]
[null,null,null,"Productivity",{"$f":"CHOOSE(Inputs!$D$130,Inputs!BI46,Inputs!BJ46,Inputs!BK46,Inputs!BL46,Inputs!BM46)","v":1201200},{"$f":"CHOOSE(Inputs!$D$130,Inputs!BP46,Inputs!BQ46,Inputs!BR46,Inputs!BS46,Inputs!BT46)","v":1201200},{"$f":"E14-F14","v":0}]
[null,null,null,"Cost of staff turnover",{"$f":"(CHOOSE(Inputs!$D$130,Inputs!BI47,Inputs!BJ47,Inputs!BK47,Inputs!BL47,Inputs!BM47))","v":62561.047200000001},{"$f":"(CHOOSE(Inputs!$D$130,Inputs!BP47,Inputs!BQ47,Inputs!BR47,Inputs!BS47,Inputs!BT47))","v":48484.811580000001},{"$f":"(F15-E15)","v":-14076.235619999999}]
{"$rows_left_out":115}
{"sheet":"SA","index":5,"n_rows":120,"n_cols":49,"rows_kept":120,"cut":false,"hidden":false,"merged":[[3,2,3,3]]}
[]
[]
[]
[null,null,"XXXXXXXXXXX"]
[]
[]
[]
[]
[]
[]
[null,null,null,null,null,null,{"$f":"IF(AbsenceType=1,\"Please note that these results are for STSA\",\"Please note that these results are for LTSA\")","v":"Please note that these results are for LTSA"}]
[]
[null,null,null,null,null,null,null,null,null,null,null,null,null,null,null,null,null,null,null,null,null,null,null,null,null,null,null,null,null,null,null,null,null,null,null,null,null,null,null,null,"Before","After","Difference"]
[null,null,null,null,null,null,null,null,null,null,null,null,null,null,null,null,null,null,null,null,null,null,null,null,null,null,null,null,null,null,null,null,null,null,null,null,null,null,null,"Cost of absenteeism",25502.399999999998,22952.16,-2550.239999999998]
[null,null,null,null,null,null,null,null,null,null,null,null,null,null,null,null,null,null,null,null,null,null,null,null,null,null,null,null,null,null,null,null,null,null,null,null,null,null,null,"Income from increased productivity",1185660,1197516.6000000001,-11856.600000000093]
{"$rows_left_out":106}
{"sheet":"SAAbs","index":6,"n_rows":119,"n_cols":49,"rows_kept":119,"cut":false,"hidden":false,"merged":[[3,2,3,3]]}
[]
[]
[]
[null,null,"XXXXXXXXXXX"]
[]
[]
[]
[]
[]
[]
[null,null,null,null,null,null,{"$f":"IF(AbsenceType=1,\"Please note that these results are for STSA\",\"Please note that these results are for LTSA\")","v":"Please note that these results are for LTSA"}]
[]
[null,null,null,null,null,null,null,null,null,null,null,null,null,null,null,null,null,null,null,null,null,null,null,null,null,null,null,null,null,null,null,null,null,null,null,null,null,null,null,null,"Before","After","Difference"]
[null,null,null,null,null,null,null,null,null,null,null,null,null,null,null,null,null,null,null,null,null,null,null,null,null,null,null,null,null,null,null,null,null,null,null,null,null,null,null,"Cost of absenteeism",25502.399999999998,22952.16,-2550.239999999998]
[null,null,null,null,null,null,null,null,null,null,null,null,null,null,null,null,null,null,null,null,null,null,null,null,null,null,null,null,null,null,null,null,null,null,null,null,null,null,null,"Income from increased productivity",1185660,1197516.6000000001,-11856.600000000093]
{"$rows_left_out":105}
{"sheet":"SAProd","index":7,"n_rows":119,"n_cols":49,"rows_kept":119,"cut":false,"hidden":false,"merged":[[3,2,3,3]]}
[]
[]
[]
[null,null,"XXXXXXXXXXX"]
[]
[]
[]
[]
[]
[]
[null,null,null,null,null,null,{"$f":"IF(AbsenceType=1,\"Please note that these results are for STSA\",\"Please note that these results are for LTSA\")","v":"Please note that these results are for LTSA"}]
[]
[null,null,null,null,null,null,null,null,null,null,null,null,null,null,null,null,null,null,null,null,null,null,null,null,null,null,null,null,null,null,null,null,null,null,null,null,null,null,null,null,"Before","After","Difference"]
[null,null,null,null,null,null,null,null,null,null,null,null,null,null,null,null,null,null,null,null,null,null,null,null,null,null,null,null,null,null,null,null,null,null,null,null,null,null,null,"Cost of absenteeism",25502.399999999998,22952.16,-2550.239999999998]
[null,null,null,null,null,null,null,null,null,null,null,null,null,null,null,null,null,null,null,null,null,null,null,null,null,null,null,null,null,null,null,null,null,null,null,null,null,null,null,"Income from increased productivity",1185660,1197516.6000000001,-11856.600000000093]
{"$rows_left_out":105}
{"sheet":"SATurnover","index":8,"n_rows":119,"n_cols":49,"rows_kept":119,"cut":false,"hidden":false,"merged":[[3,2,3,3]]}
[]
[]
[]
[null,null,"XXXXXXXXXXX"]
[]
[]
[]
[]
[]
[]
[null,null,null,null,null,null,{"$f":"IF(AbsenceType=1,\"Please note that these results are for STSA\",\"Please note that these results are for LTSA\")","v":"Please note that these results are for LTSA"}]
[]
[null,null,null,null,null,null,null,null,null,null,null,null,null,null,null,null,null,null,null,null,null,null,null,null,null,null,null,null,null,null,null,null,null,null,null,null,null,null,null,null,"Before","After","Difference"]
[null,null,null,null,null,null,null,null,null,null,null,null,null,null,null,null,null,null,null,null,null,null,null,null,null,null,null,null,null,null,null,null,null,null,null,null,null,null,null,"Cost of absenteeism",25502.399999999998,22952.16,-2550.239999999998]
[null,null,null,null,null,null,null,null,null,null,null,null,null,null,null,null,null,null,null,null,null,null,null,null,null,null,null,null,null,null,null,null,null,null,null,null,null,null,null,"Income from increased productivity",1185660,1197516.6000000001,-11856.600000000093]
{"$rows_left_out":105}
{"sheet":"SAHealth","index":9,"n_rows":119,"n_cols":49,"rows_kept":119,"cut":false,"hidden":false,"merged":[[3,2,3,3]]}
[]
[]
[]
[null,null,"XXXXXXXXXXX"]
[]
[]
[]
[]
[]
[]
[null,null,null,null,null,null,{"$f":"IF(AbsenceType=1,\"Please note that these results are for STSA\",\"Please note that these results are for LTSA\")","v":"Please note that these results are for LTSA"}]
[]
[null,null,null,null,null,null,null,null,null,null,null,null,null,null,null,null,null,null,null,null,null,null,null,null,null,null,null,null,null,null,null,null,null,null,null,null,null,null,null,null,"Before","After","Difference"]
[null,null,null,null,null,null,null,null,null,null,null,null,null,null,null,null,null,null,null,null,null,null,null,null,null,null,null,null,null,null,null,null,null,null,null,null,null,null,null,"Cost of absenteeism",25502.399999999998,22952.16,-2550.239999999998]
[null,null,null,null,null,null,null,null,null,null,null,null,null,null,null,null,null,null,null,null,null,null,null,null,null,null,null,null,null,null,null,null,null,null,null,null,null,null,null,"Income from increased productivity",1185660,1197516.6000000001,-11856.600000000093]
{"$rows_left_out":105}
{"sheet":"SASoc","index":10,"n_rows":119,"n_cols":49,"rows_kept":119,"cut":false,"hidden":false,"merged":[[3,2,3,3]]}
[]
[]
[]
[null,null,"XXXXXXXXXXX"]
[]
[]
[]
[]
[]
[]
[null,null,null,null,null,null,{"$f":"IF(AbsenceType=1,\"Please note that these results are for STSA\",\"Please note that these results are for LTSA\")","v":"Please note that these results are for LTSA"}]
[]
[null,null,null,null,null,null,null,null,null,null,null,null,null,null,null,null,null,null,null,null,null,null,null,null,null,null,null,null,null,null,null,null,null,null,null,null,null,null,null,null,"Before","After","Difference"]
[null,null,null,null,null,null,null,null,null,null,null,null,null,null,null,null,null,null,null,null,null,null,null,null,null,null,null,null,null,null,null,null,null,null,null,null,null,null,null,"Cost of absenteeism",25502.399999999998,22952.16,-2550.239999999998]
[null,null,null,null,null,null,null,null,null,null,null,null,null,null,null,null,null,null,null,null,null,null,null,null,null,null,null,null,null,null,null,null,null,null,null,null,null,null,null,"Income from increased productivity",1185660,1197516.6000000001,-11856.600000000093]
{"$rows_left_out":105}
{"sheet":"SAEff","index":11,"n_rows":37,"n_cols":49,"rows_kept":37,"cut":false,"hidden":false,"merged":[[3,2,3,3]]}
[]
[]
[]
[null,null,"XXXXXXXXXXX"]
[]
[]
[]
[]
[]
[]
[null,null,null,null,null,null,{"$f":"IF(AbsenceType=1,\"Please note that these results are for STSA\",\"Please note that these results are for LTSA\")","v":"Please note that these results are for LTSA"}]
[]
[null,null,null,null,null,null,null,null,null,null,null,null,null,null,null,null,null,null,null,null,null,null,null,null,null,null,null,null,null,null,null,null,null,null,null,null,null,null,null,null,"Before","After","Difference"]
[null,null,null,null,null,null,null,null,null,null,null,null,null,null,null,null,null,null,null,null,null,null,null,null,null,null,null,null,null,null,null,null,null,null,null,null,null,null,null,"Cost of absenteeism",25502.399999999998,22952.16,-2550.239999999998]
[null,null,null,null,null,null,null,null,null,null,null,null,null,null,null,null,null,null,null,null,null,null,null,null,null,null,null,null,null,null,null,null,null,null,null,null,null,null,null,"Income from increased productivity",1185660,1197516.6000000001,-11856.600000000093]
{"$rows_left_out":23}
{"sheet":"Slider","index":12,"n_rows":38,"n_cols":49,"rows_kept":38,"cut":false,"hidden":false,"merged":[[3,2,3,3]]}
[]
[]
[]
[null,null,"XXXXXXXXXXX"]
[]
[]
[]
[]
[null,null,null,null,null,null,{"$f":"IF(AbsenceType=1,\"Please note that these results are for STSA\",\"Please note that these results are for LTSA\")","v":"Please note that these results are for LTSA"}]
[]
[null,null,null,null,"Before","After","Cost savings"]
[null,null,null,"Cost of absenteeism",{"$f":"'Base case'!E13","v":94968},{"$f":"'Base case'!F13","v":56980.799999999996},{"$f":"'Base case'!G13","v":-37987.200000000004}]
[null,null,null,"Income from productivity",{"$f":"'Base case'!E14","v":1201200},{"$f":"'Base case'!F14","v":1201200},{"$f":"'Base case'!G14","v":0},null,null,null,null,null,null,null,null,null,null,null,null,null,null,null,null,null,null,null,null,null,null,null,null,null,null,null,null,null,null,null,null,null,"Before","After","Difference"]
[null,null,null,"Cost of staff turnover",{"$f":"'Base case'!E15","v":62561.047200000001},{"$f":"'Base case'!F15","v":48484.811580000001},{"$f":"'Base case'!G15","v":-14076.235619999999},null,null,null,null,null,null,null,null,null,null,null,null,null,null,null,null,null,null,null,null,null,null,null,null,null,null,null,null,null,null,null,null,"Cost of absenteeism",25502.399999999998,22952.16,-2550.239999999998]
[null,null,null,{"$f":"Inputs!D31","v":0},{"$f":"'Base case'!E16","v":0},{"$f":"'Base case'!F16","v":0},{"$f":"'Base case'!G16","v":0},null,null,null,null,null,null,null,null,null,null,null,null,null,null,null,null,null,null,null,null,null,null,null,null,null,null,null,null,null,null,null,null,"Income from increased productivity",1185660,1197516.6000000001,-11856.600000000093]
{"$rows_left_out":24}
{"sheet":"Four-way","index":13,"n_rows":40,"n_cols":51,"rows_kept":40,"cut":false,"hidden":false,"merged":[[3,2,3,4]]}
[]
[]
[]
[null,null,"XXXXXXXXXXX"]
[]
[]
[null,null,null,null,null,null,null,"Please select category to view:",null,null,null,"Four-way SA inputs"]
[null,null,null,null,null,null,null,"Absenteeism",null,null,null,"Cost of intervention per person",0,100,200,400]
[null,null,null,null,null,null,null,"Productivity",null,null,null,null,"Low","Mid","High"]
[null,null,null,"Absenteeism",null,{"$f":"IF(AbsenceType=1,\"Please note that these results are for STSA\",\"Please note that these results are for LTSA\")","v":"Please note that these results are for LTSA"},null,"Staff turnover",null,null,null,"Cost of absenteeism",79.14,158.28,316.56]
[null,null,null,null,null,"Please remember to presss the 'run' button",null,null,null,null,null,"Baseline absenteeism (days)",15,30,60]
[]
[]
[null,null,null,null,null,"1. Baseline absenteeism (days)",null,"2. Baseline absenteeism (days)",null,"3. Baseline absenteeism (days)"]
[null,null,null,null,null,2.2200000000000002,null,4.4400000000000004,null,8.8800000000000008,null,null,null,null,null,null,null,null,null,null,null,null,null,null,null,null,null,null,null,null,null,null,null,null,null,null,null,null,null,null,null,null,"Before","After","Difference"]
{"$rows_left_out":26}
{"sheet":"Four-way Prod","index":14,"n_rows":40,"n_cols":51,"rows_kept":40,"cut":false,"hidden":false,"merged":[[3,2,3,4],[7,15,7,16]]}
[]
[]
[]
[null,null,"XXXXXXXXXXX"]
[]
[]
[null,null,null,null,null,null,null,"Please select category to view:",null,null,null,"Four-way SA inputs"]
[null,null,null,null,null,null,null,"Absenteeism",null,null,null,"Cost of intervention per person",0,100,200,400]
[null,null,null,null,null,null,null,"Productivity",null,null,null,null,"Low","Mid","High"]
[null,null,null,"Productivity",null,{"$f":"IF(AbsenceType=1,\"Please note that these results are for STSA\",\"Please note that these results are for LTSA\")","v":"Please note that these results are for LTSA"},null,"Staff turnover",null,null,null,"Value of employee",20020,40040,80080]
[null,null,null,null,null,"Please remember to presss the 'run' button",null,null,null,null,null,"Percentage of staff affected",0.5,0.75,1]
[]
[]
[null,null,null,null,null,"1. Percentage affected",null,"2. Percentage affected",null,"3. Percentage affected"]
[null,null,null,null,null,{"$f":"M11","v":0.5},null,{"$f":"N11","v":0.75},null,{"$f":"O11","v":1},null,null,null,null,null,null,null,null,null,null,null,null,null,null,null,null,null,null,null,null,null,null,null,null,null,null,null,null,null,null,null,null,"Before","After","Difference"]
{"$rows_left_out":26}
{"sheet":"Four-way Turnover","index":15,"n_rows":40,"n_cols":51,"rows_kept":40,"cut":false,"hidden":false,"merged":[[3,2,3,4]]}
[]
[]
[]
[null,null,"XXXXXXXXXXX"]
[]
[]
[null,null,null,null,null,null,null,"Please select category to view:",null,null,null,"Four-way SA inputs"]
[null,null,null,null,null,null,null,"Absenteeism",null,null,null,"Cost of intervention per person",0,155.5,311,{"$f":"O8*2","v":622}]
[null,null,null,null,null,null,null,"Productivity",null,null,null,null,"Low","Mid","High"]
[null,null,null,"Staff turnover",null,{"$f":"IF(AbsenceType=1,\"Please note that these results are for STSA\",\"Please note that these results are for LTSA\")","v":"Please note that these results are for LTSA"},null,"Staff turnover",null,null,null,"Cost per case",7666.8,15333.59,30667.18]
[null,null,null,null,null,"Please remember to presss the 'run' button",null,null,null,null,null,"Baseline rate of turnover",6.8000000000000005E-2,0.13600000000000001,0.27200000000000002]
[]
[]
[null,null,null,null,null,"1. Baseline rate of turnover",null,"2. Baseline rate of turnover",null,"3. Baseline rate of turnover"]
[null,null,null,null,null,{"$f":"M11","v":6.8000000000000005E-2},null,{"$f":"N11","v":0.13600000000000001},null,{"$f":"O11","v":0.27200000000000002},null,null,null,null,null,null,null,null,null,null,null,null,null,null,null,null,null,null,null,null,null,null,null,null,null,null,null,null,null,null,null,null,"Before","After","Difference"]
{"$rows_left_out":25}