{"text_format":"1","workbook":"xlsx","n_sheets":14,"sheets":["Cover","Conceptual model","Inputs >>","BPT input","Data","Override","Final data","ANALYSIS>","Phase 1","Phase 2","Unit cost","Phase 3","Allowance","F_Outputs"],"not_rendered":{"charts":0,"images":1,"macros":1,"external_links":0,"defined_names":1600,"comments":0,"pivot_tables":1},"unopened":[],"bounds":{"document_bytes":16777216,"sheet_cells":100000,"rows_first":2000,"rows_last":500,"rows_between":2000,"halvings":0,"cell_chars":16384,"cell_head_chars":4096},"cells_cut":0,"cells_raw":0,"read":"whole","date_system":"1900"}

{"sheet":"Cover","index":0,"n_rows":40,"n_cols":3,"rows_kept":40,"cut":false,"hidden":false,"merged":[]}
["Cover"]
[]
[null,"Water net zero"]
[]
[null,"Model code:","PR24CA44"]
[null,"Version number:",1]
{"$rows_left_out":35}
{"sheet":"Conceptual model","index":1,"n_rows":49,"n_cols":1,"rows_kept":49,"cut":false,"hidden":false,"merged":[]}
[{"$f":" RIGHT(CELL(\"filename\", A1), LEN(CELL(\"filename\", A1)) - SEARCH(\"]\", CELL(\"filename\", A1)))","v":{"$error":"#VALUE!"}}]
[]
["Conceptual model "]
[]
[]
[]
{"$rows_left_out":44}
{"sheet":"Inputs >>","index":2,"n_rows":0,"n_cols":0,"rows_kept":0,"cut":false,"hidden":false,"merged":[]}

{"sheet":"BPT input","index":3,"n_rows":34,"n_cols":38,"rows_kept":34,"cut":false,"hidden":false,"merged":[[1,2,3,2],[1,3,3,3],[1,4,3,4],[1,5,3,5],[1,6,3,6],[1,7,3,7],[1,37,3,37],[3,8,3,10],[3,11,3,13],[3,14,3,16],[3,17,3,19],[3,20,3,22],[3,23,3,27]]}
[]
[null,null,"Scheme ID","Scheme name","Scheme description","Selected or Feasible","Units","DPs",1,2,3,4,5,6,7,8,9,10,11,12,13,14,15,16,17,18,19,20,null,21,22,23,24,25,null,26,null,"PR24 BP reference"]
[null,null,null,null,null,null,null,null,"Scheme Capex","Scheme Opex","Scheme Totex","Scheme Capex","Scheme Opex","Scheme Totex","Scheme Capex","Scheme Opex","Scheme Totex","Scheme Capex","Scheme Opex","Scheme Totex","Scheme Capex","Scheme Opex","Scheme Totex","AMP8  Capex Total","AMP8  Opex Total","AMP8  Totex Total","Water Resources costs (% of AMP 8 Totex)","Water Network + costs (% of AMP 8 Totex)",null,"Scheme benefits (cumulative impact on tCO2e)","Scheme benefits (cumulative impact on tCO2e)","Scheme benefits (cumulative impact on tCO2e)","Scheme benefits (cumulative impact on tCO2e)","Scheme benefits (cumulative impact on tCO2e)",null,"Overall scheme impact on total greehouse gas emissions  (total impact on tCO2e)"]
["Company","Date of BPT",null,null,null,null,null,null,"2025-26",null,null,"2026-27",null,null,"2027-28",null,null,"2028-29",null,null,"2029-30",null,null,"2025-30",null,null,null,null,null,"2025-26","2026-27","2027-28","2028-29","2029-30",null,"2029-30"]
["ANH","2024-01-25","CW21.1","AMP8 Small Scale Solar Delivery WS","WS Mounted Panels","Feasible","£m",3,2.0169999999999999,0,2.0169999999999999,2.0169999999999999,-0.24,1.7769999999999999,2.0169999999999999,-0.48099999999999998,1.536,2.0169999999999999,-0.72099999999999997,1.296,2.0169999999999999,-0.96199999999999997,1.0549999999999999,10.085000000000001,-2.4039999999999999,7.681,0,100,null,0,-454.48,-1363.74,-2727.48,-4545.8,null,-3045.8,null,"CW19.1"]
["AFW","2024-02-08","AFW_EV","Net Zero: Electric Vehicles","To replace all operational liveried diesel vehicles with electric vehicles with an aim to remove 1920 TC02e operational carbon per year (the amount emitted by the current diesel vehicles fleet) by the end of AMP 8.","Selected","£m",3,0.91200000000000003,7.8E-2,0.99,0.96599999999999997,0.13400000000000001,1.1000000000000001,0.83599999999999997,0.17799999999999999,1.014,0.434,0.186,0.62,0.33500000000000002,0.24299999999999999,0.57799999999999996,3.4830000000000001,0.81899999999999995,4.3019999999999996,10,90,null,-322.60000000000002,-937,-1858.6,-3087.4,-4700.2,null,-4135.732,null,"CW19.1"]
{"$rows_left_out":29}
{"sheet":"Data","index":4,"n_rows":34,"n_cols":18,"rows_kept":34,"cut":false,"hidden":false,"merged":[]}
["Consolidated data"]
[]
[]
[null,null,"Company","Scheme ID","Scheme name","Selected or Feasible","Totex 2025-26","Totex 2026-27","Totex 2027-28","Totex 2028-29","Totex 2029-30","AMP8 totex (£m, 2025-30)","Carbon benefits (cumulated) 2025-26","Carbon benefits (cumulated) 2026-27","Carbon benefits (cumulated) 2027-28","Carbon benefits (cumulated) 2028-29","Carbon benefits (cumulated) 2029-30","Scheme benefits (tCO2e cumulative, 2029-30)"]
[null,1,{"$f":"'BPT input'!A5","v":"ANH"},{"$f":"'BPT input'!C5","v":"CW21.1"},{"$f":"'BPT input'!D5","v":"AMP8 Small Scale Solar Delivery WS"},{"$f":"_xlfn.IFS('BPT input'!F5=\"Selected\", 'BPT input'!F5, 'BPT input'!F5=\"Feasible\",'BPT input'!F5, 'BPT input'!F5=\"Select from Dropdown\", \"Selected\")","v":"Feasible"},{"$f":"'BPT input'!K5","v":2.0169999999999999},{"$f":"'BPT input'!N5","v":1.7769999999999999},{"$f":"'BPT input'!Q5","v":1.536},{"$f":"'BPT input'!T5","v":1.296},{"$f":"'BPT input'!W5","v":1.0549999999999999},{"$f":"'BPT input'!Z5","v":7.681},{"$f":"'BPT input'!AD5","v":0},{"$f":"'BPT input'!AE5","v":-454.48},{"$f":"'BPT input'!AF5","v":-1363.74},{"$f":"'BPT input'!AG5","v":-2727.48},{"$f":"'BPT input'!AH5","v":-4545.8},{"$f":"'BPT input'!AH5","v":-4545.8}]
[null,2,{"$f":"'BPT input'!A6","v":"AFW"},{"$f":"'BPT input'!C6","v":"AFW_EV"},{"$f":"'BPT input'!D6","v":"Net Zero: Electric Vehicles"},{"$f":"_xlfn.IFS('BPT input'!F6=\"Selected\", 'BPT input'!F6, 'BPT input'!F6=\"Feasible\",'BPT input'!F6, 'BPT input'!F6=\"Select from Dropdown\", \"Selected\")","v":"Selected"},{"$f":"'BPT input'!K6","v":0.99},{"$f":"'BPT input'!N6","v":1.1000000000000001},{"$f":"'BPT input'!Q6","v":1.014},{"$f":"'BPT input'!T6","v":0.62},{"$f":"'BPT input'!W6","v":0.57799999999999996},{"$f":"'BPT input'!Z6","v":4.3019999999999996},{"$f":"'BPT input'!AD6","v":-322.60000000000002},{"$f":"'BPT input'!AE6","v":-937},{"$f":"'BPT input'!AF6","v":-1858.6},{"$f":"'BPT input'!AG6","v":-3087.4},{"$f":"'BPT input'!AH6","v":-4700.2},{"$f":"'BPT input'!AH6","v":-4700.2}]
{"$rows_left_out":29}
{"sheet":"Override","index":5,"n_rows":35,"n_cols":21,"rows_kept":35,"cut":false,"hidden":false,"merged":[]}
[null,"Override data"]
[]
[]
["DD BPT link","Scheme resubmitted in DD ",null,"Company","Scheme ID","Scheme name","Selected or Feasible","Totex 2025-26","Totex 2026-27","Totex 2027-28","Totex 2028-29","Totex 2029-30","AMP8 totex (£m, 2025-30)","Carbon benefits (cumulated) 2025-26","Carbon benefits (cumulated) 2026-27","Carbon benefits (cumulated) 2027-28","Carbon benefits (cumulated) 2028-29","Carbon benefits (cumulated) 2029-30","Scheme benefits (tCO2e cumulative, 2029-30)","Reason for override","Reason for override 2"]
["ANH_DD_004-v7-Main-data-tables.xlsb","No",1,{"$f":"IF(Data!C5=\"\",\"\",Data!C5)","v":"ANH"},"CW21.1","AMP8 Small Scale Solar Delivery WS","Not defined",0,0,0,0,0,0,0,0,0,0,0,0,"Rejected at DD: no company representation."]
[null,"No",2,{"$f":"IF(Data!C6=\"\",\"\",Data!C6)","v":"AFW"},"AFW_EV","Net Zero: Electric Vehicles","Not defined",0,0,0,0,0,0,0,0,0,0,0,0,"Rejected at DD: no company representation."]
{"$rows_left_out":30}
{"sheet":"Final data","index":6,"n_rows":36,"n_cols":21,"rows_kept":36,"cut":false,"hidden":false,"merged":[]}
["Final data"]
[]
[]
["Scheme resubmitted in DD ","Number","Company","Scheme ID","Scheme name","Selected or Feasible","Totex 2025-26","Totex 2026-27","Totex 2027-28","Totex 2028-29","Totex 2029-30","AMP8 totex (£m, 2025-30)","Carbon benefits (cumulated) 2025-26","Carbon benefits (cumulated) 2026-27","Carbon benefits (cumulated) 2027-28","Carbon benefits (cumulated) 2028-29","Carbon benefits (cumulated) 2029-30","Scheme benefits (tCO2e cumulative, 2029-30)","Unit cost over AMP8 (000£/tCO2e)","Unit cost over AMP8 (£/tCO2e)","Final Decision"]
["No",1,{"$f":"IF(Override!D5<>\"\",Override!D5,Data!C5)","v":"ANH"},{"$f":"IF(Override!E5<>\"\",Override!E5,Data!D5)","v":"CW21.1"},{"$f":"IF(Override!F5<>\"\",Override!F5,Data!E5)","v":"AMP8 Small Scale Solar Delivery WS"},{"$f":"IF(Override!G5<>\"\",Override!G5,Data!F5)","v":"Not defined"},{"$f":"IF(Override!H5<>\"\",Override!H5,Data!G5)","v":0},{"$f":"IF(Override!I5<>\"\",Override!I5,Data!H5)","v":0},{"$f":"IF(Override!J5<>\"\",Override!J5,Data!I5)","v":0},{"$f":"IF(Override!K5<>\"\",Override!K5,Data!J5)","v":0},{"$f":"IF(Override!L5<>\"\",Override!L5,Data!K5)","v":0},{"$f":"IF(Override!M5<>\"\",Override!M5,Data!L5)","v":0},{"$f":"IF(Override!N5<>\"\",Override!N5,Data!M5)","v":0},{"$f":"IF(Override!O5<>\"\",Override!O5,Data!N5)","v":0},{"$f":"IF(Override!P5<>\"\",Override!P5,Data!O5)","v":0},{"$f":"IF(Override!Q5<>\"\",Override!Q5,Data!P5)","v":0},{"$f":"IF(Override!R5<>\"\",Override!R5,Data!Q5)","v":0},{"$f":"IF(Override!S5<>\"\",Override!S5,Data!R5)","v":0},{"$f":"IFERROR(((ABS(L5)*1000)/ABS(R5)),\"-\")","v":"-"},{"$f":"IFERROR(S5*1000,\"-\")","v":"-"},{"$f":"VLOOKUP(B5,'Phase 2'!B5:W34,22,FALSE)","v":"Fail"}]
["No",2,{"$f":"IF(Override!D6<>\"\",Override!D6,Data!C6)","v":"AFW"},{"$f":"IF(Override!E6<>\"\",Override!E6,Data!D6)","v":"AFW_EV"},{"$f":"IF(Override!F6<>\"\",Override!F6,Data!E6)","v":"Net Zero: Electric Vehicles"},{"$f":"IF(Override!G6<>\"\",Override!G6,Data!F6)","v":"Not defined"},{"$f":"IF(Override!H6<>\"\",Override!H6,Data!G6)","v":0},{"$f":"IF(Override!I6<>\"\",Override!I6,Data!H6)","v":0},{"$f":"IF(Override!J6<>\"\",Override!J6,Data!I6)","v":0},{"$f":"IF(Override!K6<>\"\",Override!K6,Data!J6)","v":0},{"$f":"IF(Override!L6<>\"\",Override!L6,Data!K6)","v":0},{"$f":"IF(Override!M6<>\"\",Override!M6,Data!L6)","v":0},{"$f":"IF(Override!N6<>\"\",Override!N6,Data!M6)","v":0},{"$f":"IF(Override!O6<>\"\",Override!O6,Data!N6)","v":0},{"$f":"IF(Override!P6<>\"\",Override!P6,Data!O6)","v":0},{"$f":"IF(Override!Q6<>\"\",Override!Q6,Data!P6)","v":0},{"$f":"IF(Override!R6<>\"\",Override!R6,Data!Q6)","v":0},{"$f":"IF(Override!S6<>\"\",Override!S6,Data!R6)","v":0},{"$f":"IFERROR(((ABS(L6)*1000)/ABS(R6)),\"-\")","v":"-"},{"$f":"IFERROR(S6*1000,\"-\")","v":"-"},{"$f":"VLOOKUP(B6,'Phase 2'!B6:W35,22,FALSE)","v":"Fail"}]
{"$rows_left_out":31}
{"sheet":"ANALYSIS>","index":7,"n_rows":0,"n_cols":0,"rows_kept":0,"cut":false,"hidden":false,"merged":[]}

{"sheet":"Phase 1","index":8,"n_rows":42,"n_cols":27,"rows_kept":42,"cut":false,"hidden":false,"merged":[[41,1,68,4]]}
["Phase 1: Initial assessment"]
["Is the scheme true enhancement, a core business activity and has the reduction of GHG emissions as its primary driver"]
[null,"Schemes submitted",null,null,null,null,null,null,null,"Enhancement expenditure",null,null,"Net zero as the primary driver",null,null,"Core business activity",null,null,"Decisions of phase 1",null,null,"Results of phase 1"]
[null,null,"Company","Scheme ID","Scheme name",null,"Scheme description","Category",null,"Was this activity previously delivered by base expenditure? (Yes/No)","Justification",null,"Is net zero the primary driver of the scheme? (Yes/No)","Justification",null,"Is the scheme a core business activity? (Yes/No)","Justification",null,"Phase 1 assessment decision (pass/fail)","Rationale",null,null,"Company","Scheme ID","Scheme name",null,"AMP8 totex (£m, 2025-30)"]
[null,1,{"$f":"IF(Override!D5<>\"\",Override!D5,Data!C5)","v":"ANH"},"CW21.1",{"$f":"IF(Override!F5<>\"\",Override!F5,Data!E5)","v":"AMP8 Small Scale Solar Delivery WS"},null,"WS Mounted Panels - Solar PV on 400 sites and 20GWhs of electricity","Renewable energy",null,"No","Renewables excluded from price review",null,"Yes","Clear net zero driver - A secondary driver is insulation of energy costs. ",null,"No","Renewable energy investment not considered part of the appointment business",null,{"$f":"IF(OR(J5=\"Yes\",M5=\"No\",P5=\"No\"),\"Fail\",\"Pass\")","v":"Fail"},"Not a core business activity",null,1,{"$f":"IF($S5=\"Pass\",C5,\"\")","v":""},{"$f":"IF($S5=\"Pass\",D5,\"\")","v":""},{"$f":"IF($S5=\"Pass\",E5,\"\")","v":""},null,7.681]
[null,2,{"$f":"IF(Override!D6<>\"\",Override!D6,Data!C6)","v":"AFW"},"AFW_EV",{"$f":"IF(Override!F6<>\"\",Override!F6,Data!E6)","v":"Net Zero: Electric Vehicles"},null,"To replace all operational liveried diesel vehicles with electric vehicles with an aim to remove 1920 TC02e operational carbon per year (the amount emitted by the current diesel vehicles fleet) ","Transport",null,"Yes","Transport historically funded under base allowance. Affinity Water have already been investing in EVs through base in PR19 (20% of fleet should be electric by 2025). This proposal is to support fully transitioning fleet to electric by end of the 2025-2030 period. ",null,"Yes","We consider that charging infrastructures are new assets that will enable an upgrade of the company's transport, with a decarbonised fleet. This scheme is therefore clear enhancement, driven primarily by net zero. ",null,"No",null,null,{"$f":"IF(OR(J6=\"Yes\",M6=\"No\",P6=\"No\"),\"Fail\",\"Pass\")","v":"Fail"},"Should continue to be funded by Base allowance",null,2,"","","",null,4.3019999999999996]
{"$rows_left_out":37}
{"sheet":"Phase 2","index":9,"n_rows":40,"n_cols":31,"rows_kept":40,"cut":false,"hidden":false,"merged":[[39,1,74,4]]}
["Phase 2: Net zero value assessment"]
["Is the scheme supporting UK government net zero targets, innovation and sector learning and align with our net zero principles"]
[null,"Scheme submitted",null,null,null,null,"Scheme description",null,null,"Additional information requested",null,null,null,"Assessment of tech maturity and contribution to innovation, learning and efficiency",null,null,"Confidence of impact on emissions",null,null,"IED overlap",null,null,"Decisions of phase 2",null,null,"Results of phase 2"]
[null,null,"Company","Scheme ID","Scheme name",null,"Category","Scheme description",null,"Query link","Purpose of query","Description of technology",null,"Innovation rating","Justification",null,"Innovation rating","Justification",null,"Overlap (Yes/No)","Justification",null,"Phase 2 assessment decision (pass/fail)","Justification",null,null,"Company","Scheme ID","Scheme name",null,"AMP8 totex (£m, 2025-30)"]
[null,1,{"$f":"'Phase 1'!W5","v":""},{"$f":"'Phase 1'!X5","v":""},{"$f":"'Phase 1'!Y5","v":""},null,{"$f":"IF(C5<>\"\", 'Phase 1'!#REF!, \"\")","v":""},{"$f":"IF(E5<>\"\", 'Phase 1'!G5, \"\")","v":""},null,null,null,null,null,null,null,null,null,null,null,null,null,null,"Fail",null,null,1,{"$f":"IF($W5=\"Pass\",C5,\"\")","v":""},{"$f":"IF($W5=\"Pass\",D5,\"\")","v":""},{"$f":"IF($W5=\"Pass\",E5,\"\")","v":""},null,7.681]
[null,2,{"$f":"'Phase 1'!W6","v":""},{"$f":"'Phase 1'!X6","v":""},{"$f":"'Phase 1'!Y6","v":""},null,{"$f":"IF(C6<>\"\", 'Phase 1'!#REF!, \"\")","v":""},{"$f":"IF(E6<>\"\", 'Phase 1'!G6, \"\")","v":""},null,null,null,null,null,null,null,null,null,null,null,null,null,null,"Fail",null,null,2,"","","",null,4.3019999999999996]
{"$rows_left_out":35}
{"sheet":"Unit cost","index":10,"n_rows":37,"n_cols":30,"rows_kept":37,"cut":false,"hidden":false,"merged":[[36,1,54,4]]}
["Deep-dive: Process emission schemes"]
[]
[null,"Scheme submitted",null,null,null,null,"Deep dive into schemes",null,null,null,null,null,null,"IED overlap",null,null,null,"Carbon benefits ",null,null,null,null,null,null,null,null,null,null,"Stated asset life"]
[null,null,"Company","Scheme ID","Scheme name",null,"Subcategory","Intervention type","Intervention 1","Intervention 2","Intervention 3","Description",null,"Wastewater intervention","Bioresource intervention","Additional information",null,"AMP8 totex (£m)","Carbon benefits (tCO2e)","AMP8 (£000/tCO2e)","AMP8 £/tCO2e","5 years £/tCO2e","10 years £/tCO2e","15 years £/tCO2e","20 years £/tCO2e","25 years £/tCO2e","30 years £/tCO2e",null,"Years","tCo2e"]
[null,1,{"$f":"IF('Phase 1'!$S5=\"Pass\",'Phase 1'!C5,\"\")","v":""},{"$f":"IF('Phase 1'!$S5=\"Pass\",'Phase 1'!D5,\"\")","v":""},{"$f":"IF('Phase 1'!$S5=\"Pass\",'Phase 1'!E5,\"\")","v":""},null,null,null,null,null,null,null,null,null,null,null,null,{"$f":"IF($D5<>\"\",'Final data'!L5,\"\")","v":""},{"$f":"IF($D5<>\"\",'Final data'!R5,\"\")","v":""},{"$f":"IF($D5<>\"\",'Final data'!S5,\"\")","v":""},{"$f":"IFERROR(T5*1000,\"\")","v":""},{"$f":"IFERROR(U5/5,\"\")","v":""},{"$f":"IFERROR(V5/10,\"\")","v":""},{"$f":"IFERROR(W5/15,\"\")","v":""},{"$f":"IFERROR(X5/20,\"\")","v":""},{"$f":"IFERROR(Y5/25,\"\")","v":""},{"$f":"IFERROR(Z5/30,\"\")","v":""},null,null,{"$f":"IFERROR(AVERAGE(V5:AA5),\"\")","v":""}]
[null,2,{"$f":"IF('Phase 1'!$S6=\"Pass\",'Phase 1'!C6,\"\")","v":""},{"$f":"IF('Phase 1'!$S6=\"Pass\",'Phase 1'!D6,\"\")","v":""},{"$f":"IF('Phase 1'!$S6=\"Pass\",'Phase 1'!E6,\"\")","v":""},null,null,null,null,null,null,null,null,null,null,null,null,{"$f":"IF($D6<>\"\",'Final data'!L6,\"\")","v":""},{"$f":"IF($D6<>\"\",'Final data'!R6,\"\")","v":""},{"$f":"IF($D6<>\"\",'Final data'!S6,\"\")","v":""},"",{"$f":"IFERROR(U6/5,\"\")","v":""},{"$f":"IFERROR(V6/10,\"\")","v":""},{"$f":"IFERROR(W6/15,\"\")","v":""},{"$f":"IFERROR(X6/20,\"\")","v":""},{"$f":"IFERROR(Y6/25,\"\")","v":""},{"$f":"IFERROR(Z6/30,\"\")","v":""},null,null,{"$f":"IFERROR(AVERAGE(V6:AA6),\"\")","v":""}]
{"$rows_left_out":32}
{"sheet":"Phase 3","index":11,"n_rows":38,"n_cols":7,"rows_kept":38,"cut":false,"hidden":false,"merged":[[37,1,43,4]]}
["Phase 3: Unit cost ranking"]
[]
[null,"Schemes passed in phase 2"]
[null,null,"Company","Scheme ID","Scheme name",null,"Unit cost (£000/tCO2e)"]
[null,1,{"$f":"'Phase 2'!AA5","v":""},{"$f":"'Phase 2'!AB5","v":""},{"$f":"'Phase 2'!AC5","v":""},null,{"$f":"IF(C5<>\"\",'Final data'!S5,\"\")","v":""}]
[null,2,{"$f":"'Phase 2'!AA6","v":""},{"$f":"'Phase 2'!AB6","v":""},{"$f":"'Phase 2'!AC6","v":""},null,{"$f":"IF(C6<>\"\",'Final data'!S6,\"\")","v":""}]
{"$rows_left_out":33}
{"sheet":"Allowance","index":12,"n_rows":56,"n_cols":20,"rows_kept":56,"cut":false,"hidden":false,"merged":[[2,0,2,15],[36,6,39,7],[40,14,40,15],[40,11,40,12],[40,17,40,19]]}
["Allowance"]
[]
["Summary of allowed costs "]
[]
[null,"Final list of schemes",null,null,null,null,null,"AMP8 totex (£m)",null,null,null,null,null,null,"Cumulated carbon benefits (tCO2e)"]
[null,null,"Company","Scheme ID","Scheme name","Selected or Feasible",null,"2025-26","2026-27","2027-28","2028-29","2029-30","AMP8 totex",null,"2025-26","2026-27","2027-28","2028-29","2029-30","AMP8 benefits"]
{"$rows_left_out":51}
{"sheet":"F_Outputs","index":13,"n_rows":139,"n_cols":13,"rows_kept":139,"cut":false,"hidden":false,"merged":[]}
[null,null,"PR24CA44"]
["Acronym","Reference","Item description","Unit","Model","Constant","2023-24","2024-25","2025-26","2026-27","2027-28","2028-29","2029-30"]
[]
["ANH",{"$f":"CONCATENATE(\"C_\", $C$1, \"_ENH_W_TOT\")","v":"C_PR24CA44_ENH_W_TOT"},"Total enhancement allowance - Water - Net zero - Totex","£m","Price Review 2024",null,null,null,{"$f":" SUMIFS(Allowance!D$17:D$33, Allowance!$C$17:$C$33, $A4)","v":0},{"$f":" SUMIFS(Allowance!E$17:E$33, Allowance!$C$17:$C$33, $A4)","v":0},{"$f":" SUMIFS(Allowance!F$17:F$33, Allowance!$C$17:$C$33, $A4)","v":0},{"$f":" SUMIFS(Allowance!G$17:G$33, Allowance!$C$17:$C$33, $A4)","v":0},{"$f":" SUMIFS(Allowance!H$17:H$33, Allowance!$C$17:$C$33, $A4)","v":0}]
["ANH",{"$f":"CONCATENATE(\"C_\", $C$1, \"_ENH_W_AP\")","v":"C_PR24CA44_ENH_W_AP"},"Total enhancement allowance - Water - Net zero - Accelerated programme","£m","Price Review 2024"]
["ANH",{"$f":"CONCATENATE(\"C_\", $C$1, \"_ENH_W_TE\")","v":"C_PR24CA44_ENH_W_TE"},"Total enhancement allowance - Water - Net zero - Transition allowance","£m","Price Review 2024"]
{"$rows_left_out":133}