{"text_format":"1","workbook":"xlsx","n_sheets":19,"sheets":["Cover","Flow chart","Inputs >>","Water_totex","F_Inputs BP","Inputs_Queries","F_Inputs SDEff","Consolidated Input","Consolidated Input Override","Final Input","Analysis >>","Unit Cost per Action","Materiality & shallow dive","Outputs >>","Allowance","Outputs to aggregator","F_Outputs","Post Adj & FS Allowances","DROPDOWN LISTS"],"not_rendered":{"charts":0,"images":1,"macros":1,"external_links":0,"defined_names":9234,"comments":0,"pivot_tables":0},"unopened":[],"bounds":{"document_bytes":16777216,"sheet_cells":100000,"rows_first":2000,"rows_last":500,"rows_between":2000,"halvings":0,"cell_chars":16384,"cell_head_chars":4096},"cells_cut":0,"cells_raw":0,"read":"whole","date_system":"1900"}

{"sheet":"Cover","index":0,"n_rows":44,"n_cols":4,"rows_kept":44,"cut":false,"hidden":false,"merged":[]}
[{"$f":" RIGHT(CELL(\"filename\", $A$1), LEN(CELL(\"filename\", $A$1)) - SEARCH(\"]\", CELL(\"filename\", $A$1)))","v":{"$error":"#VALUE!"}}]
[]
[null,"Eels fish entrainment screens"]
[]
[null,"Model code:","PR24CA48"]
[null,"Version number:",2]
{"$rows_left_out":39}
{"sheet":"Flow chart","index":1,"n_rows":49,"n_cols":1,"rows_kept":49,"cut":false,"hidden":false,"merged":[]}
[{"$f":" RIGHT(CELL(\"filename\", A1), LEN(CELL(\"filename\", A1)) - SEARCH(\"]\", CELL(\"filename\", A1)))","v":{"$error":"#VALUE!"}}]
[]
["Conceptual model "]
[]
[]
[]
{"$rows_left_out":44}
{"sheet":"Inputs >>","index":2,"n_rows":0,"n_cols":0,"rows_kept":0,"cut":false,"hidden":false,"merged":[]}

{"sheet":"Water_totex","index":3,"n_rows":24,"n_cols":6,"rows_kept":24,"cut":false,"hidden":false,"merged":[]}
[{"$f":" RIGHT(CELL(\"filename\", A1), LEN(CELL(\"filename\", A1)) - SEARCH(\"]\", CELL(\"filename\", A1)))","v":{"$error":"#VALUE!"}}]
[null,null,"PR24 WATER TOTEX FD V2",null,"Run on 03 Sep 2024 16:48"]
[]
["Company Acronym","Item Code","Item Description","Item Unit","Item Table Suite","Constant"]
["Company Acronym","Item Code","Item Description","Item Unit","Item Table Suite","Price Review 2024"]
["Company Acronym","Item Code","Item Description","Item Unit","Item Table Suite","Run 11 - PR24 FD Data"]
{"$rows_left_out":19}
{"sheet":"F_Inputs BP","index":4,"n_rows":58,"n_cols":12,"rows_kept":58,"cut":false,"hidden":false,"merged":[]}
[{"$f":" RIGHT(CELL(\"filename\", A1), LEN(CELL(\"filename\", A1)) - SEARCH(\"]\", CELL(\"filename\", A1)))","v":{"$error":"#VALUE!"}}]
[null,null,"Eel screens v2 FD",null,"Run on 04 Sep 2024 9:05"]
["Acronym","Reference","Item description","Unit","Model","2023-24","2024-25","2025-26","2026-27","2027-28","2028-29","2029-30"]
[]
[null,null,null,null,null,"Price Review 2024","Price Review 2024","Price Review 2024","Price Review 2024","Price Review 2024","Price Review 2024","Price Review 2024"]
[null,null,null,null,null,"Run 11 - PR24 FD Data","Run 11 - PR24 FD Data","Run 11 - PR24 FD Data","Run 11 - PR24 FD Data","Run 11 - PR24 FD Data","Run 11 - PR24 FD Data","Run 11 - PR24 FD Data"]
{"$rows_left_out":53}
{"sheet":"Inputs_Queries","index":5,"n_rows":21,"n_cols":3,"rows_kept":21,"cut":false,"hidden":false,"merged":[]}
[{"$f":" RIGHT(CELL(\"filename\", $A$1), LEN(CELL(\"filename\", $A$1)) - SEARCH(\"]\", CELL(\"filename\", $A$1)))","v":{"$error":"#VALUE!"}}]
[]
[]
["Company","Number of Actions","Query Reference(s)"]
["ANH"]
["WSH",3,"OFW-OBQ-WSH-070"]
{"$rows_left_out":16}
{"sheet":"F_Inputs SDEff","index":6,"n_rows":24,"n_cols":11,"rows_kept":24,"cut":false,"hidden":false,"merged":[]}
[{"$f":" RIGHT(CELL(\"filename\", A1), LEN(CELL(\"filename\", A1)) - SEARCH(\"]\", CELL(\"filename\", A1)))","v":{"$error":"#VALUE!"}}]
[null,null,"Shallow dive efficiency - Run 11",null,"Run on 14 Nov 2024 8:13"]
[]
["Company Acronym","Item Code","Item Description","Item Unit","Item Table Suite","2025-26","2026-27","2027-28","2028-29","2029-30"]
["Company Acronym","Item Code","Item Description","Item Unit","Item Table Suite","Price Review 2024","Price Review 2024","Price Review 2024","Price Review 2024","Price Review 2024"]
["Company Acronym","Item Code","Item Description","Item Unit","Item Table Suite","Run 11 - PR24 FD Data","Run 11 - PR24 FD Data","Run 11 - PR24 FD Data","Run 11 - PR24 FD Data","Run 11 - PR24 FD Data"]
{"$rows_left_out":19}
{"sheet":"Consolidated Input","index":7,"n_rows":21,"n_cols":11,"rows_kept":21,"cut":false,"hidden":false,"merged":[]}
[{"$f":" RIGHT(CELL(\"filename\", $A$1), LEN(CELL(\"filename\", $A$1)) - SEARCH(\"]\", CELL(\"filename\", $A$1)))","v":{"$error":"#VALUE!"}}]
[]
[]
["Acronym","Item Description","Unit","2023-24","2024-25","2025-26","2026-27","2027-28","2028-29","2029-30","Total 2023-30"]
["ANH","EA/NRW environmental programme (WINEP/NEP) - Eels/fish entrainment screens; (WINEP/NEP) water totex - Total","£m",{"$f":"SUMIFS('F_Inputs BP'!F$9:F$61,'F_Inputs BP'!$A$9:$A$61,A5,'F_Inputs BP'!$B$9:$B$61,\"CW12_006TOT_PR24\")+SUMIFS('F_Inputs BP'!F$9:F$61,'F_Inputs BP'!$A$9:$A$61,A5,'F_Inputs BP'!$B$9:$B$61,\"CW17_006TOT_PR24\")","v":0},{"$f":"SUMIFS('F_Inputs BP'!G$9:G$61,'F_Inputs BP'!$A$9:$A$61,A5,'F_Inputs BP'!$B$9:$B$61,\"CW12_006TOT_PR24\")+SUMIFS('F_Inputs BP'!G$9:G$61,'F_Inputs BP'!$A$9:$A$61,A5,'F_Inputs BP'!$B$9:$B$61,\"CW17_006TOT_PR24\")","v":0},{"$f":"SUMIFS('F_Inputs BP'!H$9:H$61,'F_Inputs BP'!$A$9:$A$61,$A5,'F_Inputs BP'!$B$9:$B$61,\"CW3_006TOT_PR24\")","v":0},{"$f":"SUMIFS('F_Inputs BP'!I$9:I$61,'F_Inputs BP'!$A$9:$A$61,$A5,'F_Inputs BP'!$B$9:$B$61,\"CW3_006TOT_PR24\")","v":0},{"$f":"SUMIFS('F_Inputs BP'!J$9:J$61,'F_Inputs BP'!$A$9:$A$61,$A5,'F_Inputs BP'!$B$9:$B$61,\"CW3_006TOT_PR24\")","v":0},{"$f":"SUMIFS('F_Inputs BP'!K$9:K$61,'F_Inputs BP'!$A$9:$A$61,$A5,'F_Inputs BP'!$B$9:$B$61,\"CW3_006TOT_PR24\")","v":0},{"$f":"SUMIFS('F_Inputs BP'!L$9:L$61,'F_Inputs BP'!$A$9:$A$61,$A5,'F_Inputs BP'!$B$9:$B$61,\"CW3_006TOT_PR24\")","v":0},{"$f":"SUM(ConsInput[[#This Row],[2023-24]:[2029-30]])","v":0}]
["WSH","EA/NRW environmental programme (WINEP/NEP) - Eels/fish entrainment screens; (WINEP/NEP) water totex - Total","£m",{"$f":"SUMIFS('F_Inputs BP'!F$9:F$61,'F_Inputs BP'!$A$9:$A$61,A6,'F_Inputs BP'!$B$9:$B$61,\"CW12_006TOT_PR24\")+SUMIFS('F_Inputs BP'!F$9:F$61,'F_Inputs BP'!$A$9:$A$61,A6,'F_Inputs BP'!$B$9:$B$61,\"CW17_006TOT_PR24\")","v":0},{"$f":"SUMIFS('F_Inputs BP'!G$9:G$61,'F_Inputs BP'!$A$9:$A$61,A6,'F_Inputs BP'!$B$9:$B$61,\"CW12_006TOT_PR24\")+SUMIFS('F_Inputs BP'!G$9:G$61,'F_Inputs BP'!$A$9:$A$61,A6,'F_Inputs BP'!$B$9:$B$61,\"CW17_006TOT_PR24\")","v":0},{"$f":"SUMIFS('F_Inputs BP'!H$9:H$61,'F_Inputs BP'!$A$9:$A$61,$A6,'F_Inputs BP'!$B$9:$B$61,\"CW3_006TOT_PR24\")","v":1.704},{"$f":"SUMIFS('F_Inputs BP'!I$9:I$61,'F_Inputs BP'!$A$9:$A$61,$A6,'F_Inputs BP'!$B$9:$B$61,\"CW3_006TOT_PR24\")","v":1.6759999999999999},{"$f":"SUMIFS('F_Inputs BP'!J$9:J$61,'F_Inputs BP'!$A$9:$A$61,$A6,'F_Inputs BP'!$B$9:$B$61,\"CW3_006TOT_PR24\")","v":0.76},{"$f":"SUMIFS('F_Inputs BP'!K$9:K$61,'F_Inputs BP'!$A$9:$A$61,$A6,'F_Inputs BP'!$B$9:$B$61,\"CW3_006TOT_PR24\")","v":0.76500000000000001},{"$f":"SUMIFS('F_Inputs BP'!L$9:L$61,'F_Inputs BP'!$A$9:$A$61,$A6,'F_Inputs BP'!$B$9:$B$61,\"CW3_006TOT_PR24\")","v":0.77500000000000002},{"$f":"SUM(ConsInput[[#This Row],[2023-24]:[2029-30]])","v":5.68}]
{"$rows_left_out":16}
{"sheet":"Consolidated Input Override","index":8,"n_rows":21,"n_cols":12,"rows_kept":21,"cut":false,"hidden":false,"merged":[]}
[{"$f":" RIGHT(CELL(\"filename\", $A$1), LEN(CELL(\"filename\", $A$1)) - SEARCH(\"]\", CELL(\"filename\", $A$1)))","v":{"$error":"#VALUE!"}}]
[]
[]
["Acronym","Item Description","Unit","2023-24","2024-25","2025-26","2026-27","2027-28","2028-29","2029-30","Total 2023-30","Reason for override"]
["ANH","EA/NRW environmental programme (WINEP/NEP) - Eels/fish entrainment screens; (WINEP/NEP) water totex - Total","£m"]
["WSH","EA/NRW environmental programme (WINEP/NEP) - Eels/fish entrainment screens; (WINEP/NEP) water totex - Total","£m"]
{"$rows_left_out":16}
{"sheet":"Final Input","index":9,"n_rows":21,"n_cols":11,"rows_kept":21,"cut":false,"hidden":false,"merged":[]}
[{"$f":" RIGHT(CELL(\"filename\", $A$1), LEN(CELL(\"filename\", $A$1)) - SEARCH(\"]\", CELL(\"filename\", $A$1)))","v":{"$error":"#VALUE!"}}]
[]
[]
["Acronym","Item Description","Unit","2023-24","2024-25","2025-26","2026-27","2027-28","2028-29","2029-30","Total 2023-30"]
["ANH","EA/NRW environmental programme (WINEP/NEP) - Eels/fish entrainment screens; (WINEP/NEP) water totex - Total","£m",{"$f":"IF(ISBLANK(ConsInputOverride[[#This Row],[2023-24]]),ConsInput[[#This Row],[2023-24]],ConsInputOverride[[#This Row],[2023-24]])","v":0},{"$f":"IF(ISBLANK(ConsInputOverride[[#This Row],[2024-25]]),ConsInput[[#This Row],[2024-25]],ConsInputOverride[[#This Row],[2024-25]])","v":0},{"$f":"IF(ISBLANK(ConsInputOverride[[#This Row],[2025-26]]),ConsInput[[#This Row],[2025-26]],ConsInputOverride[[#This Row],[2025-26]])","v":0},{"$f":"IF(ISBLANK(ConsInputOverride[[#This Row],[2026-27]]),ConsInput[[#This Row],[2026-27]],ConsInputOverride[[#This Row],[2026-27]])","v":0},{"$f":"IF(ISBLANK(ConsInputOverride[[#This Row],[2027-28]]),ConsInput[[#This Row],[2027-28]],ConsInputOverride[[#This Row],[2027-28]])","v":0},{"$f":"IF(ISBLANK(ConsInputOverride[[#This Row],[2028-29]]),ConsInput[[#This Row],[2028-29]],ConsInputOverride[[#This Row],[2028-29]])","v":0},{"$f":"IF(ISBLANK(ConsInputOverride[[#This Row],[2029-30]]),ConsInput[[#This Row],[2029-30]],ConsInputOverride[[#This Row],[2029-30]])","v":0},{"$f":"SUM(D5:J5)","v":0}]
["WSH","EA/NRW environmental programme (WINEP/NEP) - Eels/fish entrainment screens; (WINEP/NEP) water totex - Total","£m",{"$f":"IF(ISBLANK(ConsInputOverride[[#This Row],[2023-24]]),ConsInput[[#This Row],[2023-24]],ConsInputOverride[[#This Row],[2023-24]])","v":0},{"$f":"IF(ISBLANK(ConsInputOverride[[#This Row],[2024-25]]),ConsInput[[#This Row],[2024-25]],ConsInputOverride[[#This Row],[2024-25]])","v":0},{"$f":"IF(ISBLANK(ConsInputOverride[[#This Row],[2025-26]]),ConsInput[[#This Row],[2025-26]],ConsInputOverride[[#This Row],[2025-26]])","v":1.704},{"$f":"IF(ISBLANK(ConsInputOverride[[#This Row],[2026-27]]),ConsInput[[#This Row],[2026-27]],ConsInputOverride[[#This Row],[2026-27]])","v":1.6759999999999999},{"$f":"IF(ISBLANK(ConsInputOverride[[#This Row],[2027-28]]),ConsInput[[#This Row],[2027-28]],ConsInputOverride[[#This Row],[2027-28]])","v":0.76},{"$f":"IF(ISBLANK(ConsInputOverride[[#This Row],[2028-29]]),ConsInput[[#This Row],[2028-29]],ConsInputOverride[[#This Row],[2028-29]])","v":0.76500000000000001},{"$f":"IF(ISBLANK(ConsInputOverride[[#This Row],[2029-30]]),ConsInput[[#This Row],[2029-30]],ConsInputOverride[[#This Row],[2029-30]])","v":0.77500000000000002},{"$f":"SUM(D6:J6)","v":5.68}]
{"$rows_left_out":16}
{"sheet":"Analysis >>","index":10,"n_rows":0,"n_cols":0,"rows_kept":0,"cut":false,"hidden":false,"merged":[]}

{"sheet":"Unit Cost per Action","index":11,"n_rows":22,"n_cols":2,"rows_kept":22,"cut":false,"hidden":false,"merged":[]}
[{"$f":" RIGHT(CELL(\"filename\", $A$1), LEN(CELL(\"filename\", $A$1)) - SEARCH(\"]\", CELL(\"filename\", $A$1)))","v":{"$error":"#VALUE!"}}]
[]
[]
["Acronym","Unit Cost per Action (£m)"]
["ANH",{"$f":"IFERROR('Final Input'!K5/Inputs_Queries!B5,\"\")","v":""}]
["WSH",{"$f":"IFERROR('Final Input'!K6/Inputs_Queries!B6,\"\")","v":1.8933333333333333}]
{"$rows_left_out":17}
{"sheet":"Materiality & shallow dive","index":12,"n_rows":23,"n_cols":9,"rows_kept":23,"cut":false,"hidden":false,"merged":[]}
[{"$f":" RIGHT(CELL(\"filename\", $A$1), LEN(CELL(\"filename\", $A$1)) - SEARCH(\"]\", CELL(\"filename\", $A$1)))","v":{"$error":"#VALUE!"}}]
[]
[]
[null,null,null,null,null,null,null,null," "]
[null,"Company","Total Totex for Price control (£m)","Totex requested in business plan (£m)","Materiality (%)","Type of assessment","Efficiency factor  ","Shallow dive output","Justification "]
[1,"ANH",{"$f":"INDEX(Water_totex!F:F,MATCH(B6,Water_totex!A:A,0))","v":4187.3538391792017},{"$f":"_xlfn.XLOOKUP(B6,'Final Input'!$A$4:$A$21,'Final Input'!$K$4:$K$21,\"Not Found\",0)","v":0},{"$f":"D6/C6","v":0},null,{"$f":"_xlfn.XLOOKUP(B6,'F_Inputs SDEff'!$A$8:$A$24,'F_Inputs SDEff'!$K$8:$K$24,\"Not Found\",0)","v":0.02},{"$f":"D6*(1-G6)","v":0}," "]
{"$rows_left_out":18}
{"sheet":"Outputs >>","index":13,"n_rows":0,"n_cols":0,"rows_kept":0,"cut":false,"hidden":false,"merged":[]}

{"sheet":"Allowance","index":14,"n_rows":27,"n_cols":12,"rows_kept":27,"cut":false,"hidden":false,"merged":[[2,0,2,15]]}
[{"$f":" RIGHT(CELL(\"filename\", $A$1), LEN(CELL(\"filename\", $A$1)) - SEARCH(\"]\", CELL(\"filename\", $A$1)))","v":{"$error":"#VALUE!"}}]
[]
["Summary of allowed costs "]
[]
[]
["Cost allowance for 2025-2030 (£m in 2022-23 prices)"]
{"$rows_left_out":22}
{"sheet":"Outputs to aggregator","index":15,"n_rows":47,"n_cols":26,"rows_kept":47,"cut":false,"hidden":false,"merged":[[2,0,2,31],[25,0,25,31]]}
[{"$f":" RIGHT(CELL(\"filename\", $A$1), LEN(CELL(\"filename\", $A$1)) - SEARCH(\"]\", CELL(\"filename\", $A$1)))","v":{"$error":"#VALUE!"}}]
[]
["Summary of submitted costs before and after reallocations"]
[]
[null,"As submitted",null,null,null,null,null,null,null,null,null,null,null,null,"As assessed"]
[null,"Company","Totex in business plan - wholesale water","2023/2024 - transition exp","2023/2024 - accelerated prog","2024/2025 - transition exp","2024/2025 - accelerated prog","2025/2026","2026/2027","2027/2028","2028/2029","2029/2030","Total",null,"Company","Totex in business plan - wholesale water","2023/2024 - transition exp","2023/2024 - accelerated prog","2024/2025 - transition exp","2024/2025 - accelerated prog","2025/2026","2026/2027","2027/2028","2028/2029","2029/2030","Total"]
{"$rows_left_out":42}
{"sheet":"F_Outputs","index":16,"n_rows":140,"n_cols":13,"rows_kept":140,"cut":false,"hidden":false,"merged":[]}
[{"$f":" RIGHT(CELL(\"filename\", A1), LEN(CELL(\"filename\", A1)) - SEARCH(\"]\", CELL(\"filename\", A1)))","v":{"$error":"#VALUE!"}}]
[null,null,"PR24CA48"]
["Acronym","Reference","Item description","Unit","Model","Constant","2023-24","2024-25","2025-26","2026-27","2027-28","2028-29","2029-30"]
[]
["ANH",{"$f":"CONCATENATE(\"C_\", $C$2, \"_ENH_W_TOT\")","v":"C_PR24CA48_ENH_W_TOT"},"Total enhancement allowance - Water - Eel fish screens - Totex","£m","Price Review 2024",null,null,null,{"$f":" SUMIFS('Outputs to aggregator'!U$30:U$47, 'Outputs to aggregator'!$O$30:$O$47, $A5)","v":0},{"$f":" SUMIFS('Outputs to aggregator'!V$30:V$47, 'Outputs to aggregator'!$O$30:$O$47, $A5)","v":0},{"$f":" SUMIFS('Outputs to aggregator'!W$30:W$47, 'Outputs to aggregator'!$O$30:$O$47, $A5)","v":0},{"$f":" SUMIFS('Outputs to aggregator'!X$30:X$47, 'Outputs to aggregator'!$O$30:$O$47, $A5)","v":0},{"$f":" SUMIFS('Outputs to aggregator'!Y$30:Y$47, 'Outputs to aggregator'!$O$30:$O$47, $A5)","v":0}]
["ANH",{"$f":"CONCATENATE(\"C_\", $C$2, \"_ENH_W_AP\")","v":"C_PR24CA48_ENH_W_AP"},"Total enhancement allowance - Water - Eel fish screens - Accelerated programme","£m","Price Review 2024",null,{"$f":"SUMIFS('Outputs to aggregator'!R$30:R$47, 'Outputs to aggregator'!$O$30:$O$47, $A6)","v":0},{"$f":"SUMIFS('Outputs to aggregator'!T$30:T$47, 'Outputs to aggregator'!$O$30:$O$47, $A6)","v":0}]
{"$rows_left_out":135}
{"sheet":"Post Adj & FS Allowances","index":17,"n_rows":480,"n_cols":13,"rows_kept":480,"cut":false,"hidden":false,"merged":[]}
[{"$f":" RIGHT(CELL(\"filename\", A1), LEN(CELL(\"filename\", A1)) - SEARCH(\"]\", CELL(\"filename\", A1)))","v":{"$error":"#VALUE!"}}]
[null,null,"PR24CA14 W post FS excl DM and Cont",null,"Run on 20 Nov 2024 13:33"]
[]
["Company Acronym","Item Code","Item Description","Item Unit","Item Table Suite","2023-24","2024-25","2025-26","2026-27","2027-28","2028-29","2029-30","Total"]
["ANH","PR24CA14_W_TOTAL_ENHANCEMENT_ALLOW_TOT","PR24 final water enhancement totex allowance- total enhancement expenditure","£m","Price Review 2024",3.0014840914681091,25.673510350120281,301.22552147391383,374.16483937972606,474.52196436634944,486.75808917946785,447.67203237642326,{"$f":"SUM(F5:L5)","v":2113.0174412174688}]
["ANH","PR24CA14_W_BIODIVERSITY_ALLOW_TOT","PR24 final water enhancement totex allowance- WINEP/NEP - biodiversity and conservation expenditure","£m","Price Review 2024",0,1.2088158603171788,0.72921654326426144,0.39627347807222019,0.46459140434476975,0.10742034915975214,0.1066950032646698,{"$f":"SUM(F6:L6)","v":3.0130126384228517}]
{"$rows_left_out":475}
{"sheet":"DROPDOWN LISTS","index":18,"n_rows":31,"n_cols":6,"rows_kept":31,"cut":false,"hidden":false,"merged":[]}
[{"$f":" RIGHT(CELL(\"filename\", A1), LEN(CELL(\"filename\", A1)) - SEARCH(\"]\", CELL(\"filename\", A1)))","v":{"$error":"#VALUE!"}}]
[]
[null,"Companies",null,null,null,"Assessment type"]
[]
[null,1,"ANH","WASC",null,"Shallow dive"]
[null,2,"HDD","WASC",null,"Deep dive"]
{"$rows_left_out":25}