{"text_format":"1","workbook":"xlsx","n_sheets":6,"sheets":["VUC-Pass","VUC-Freight","Freight","Parameters","TGamma","Passenger"],"not_rendered":{"charts":0,"images":5,"macros":1,"external_links":0,"defined_names":0,"comments":2,"pivot_tables":0},"unopened":[],"bounds":{"document_bytes":16777216,"sheet_cells":100000,"rows_first":2000,"rows_last":500,"rows_between":2000,"halvings":0,"cell_chars":16384,"cell_head_chars":4096},"cells_cut":0,"cells_raw":0,"read":"whole","date_system":"1900"}

{"sheet":"VUC-Pass","index":0,"n_rows":30,"n_cols":9,"rows_kept":30,"cut":false,"hidden":false,"merged":[[20,4,20,5],[21,4,21,5],[19,4,19,5],[20,2,21,2]]}
[]
[null,"Official CP7 VUC Calculator:",null,null,null,"Passenger vehicles"]
[null,"V8c: April 2024"]
[]
[null,"Vehicle data"]
[null,null,"Vehicle name/class",null,null,null,"(Motor)"]
[]
[null,null,"Vehicle type"]
[null,null,"Number of axles"]
[null,null,"Speed (max, mph)"]
[null,null,"Route speed (max, mph)"]
[null,null,"Speed (operating, mph)"]
[null,null,"Tare weight (t)",null,null,"Seats "]
[null,null,"Operating weight (t)"]
[null,null,"Unsprung mass (kg)"]
[null,null,"Curving class"]
[null,null,"Ct factor"]
[]
[]
[null,"Calculated VUC"]
[null,null,"2023/24 prices"]
[]
[null,null,"VUC",null,null,null,"","",""]
[]
[null,null,"VUC Breakdown"]
[null,null,"Track"]
[null,null,"Structures"]
[null,null,"Signals (variable)"]
[null,null,"Signals (fixed)"]
[null,null,"Surface damage"]

{"sheet":"VUC-Freight","index":1,"n_rows":20,"n_cols":10,"rows_kept":20,"cut":false,"hidden":false,"merged":[]}
[]
[null,"Official CP7 VUC Calculator:",null,null,null,"Freight vehicles"]
[null,"V8c: April 2024"]
[]
[null,"Vehicle data"]
[null,null,"Vehicle name/class",null,""]
[]
[null,null,"Load condition"]
[null,null,"Number of axles"]
[null,null,"Weight (t)"]
[null,null,"Unsprung mass (kg)"]
[null,null,"Curving class"]
[null,null,"Suspension band"]
[null,null,"RFC value?"]
[null,null,"Suspension factor"]
[null,null,"Ct factor (structures)"]
[]
[null,"Calculated VUC"]
[null,"All values in £/kGTM",null,null,"2023/24 prices"]
[null,null,null,"Existing CP5 rate?",null,"2024/25","2025/26","2026/27","2027/28","2028/29"]

{"sheet":"Freight","index":2,"n_rows":1686,"n_cols":21,"rows_kept":1686,"cut":false,"hidden":true,"merged":[]}
[null,"FREIGHT VEHICLE CHARACTERISTIC DATA"]
[null,"B","D","E",null,null,"H","I","J","K","M","L",null,"Q"]
[null,"Vehicle type ","Laden/Unladen","Commodity ",null,null,"Operating weight (t)",null,"Axles","Unsprung mass (kg/axle)","Curving Class","Suspension band",null,"Bespoke suspension factor ","NR comments",null,"Look up code","Vehicle Type (Tare* / Laden**)","Commodity Type","2018/19 (£/kgtm, 2017/18 prices prices)","£/kgtm (2017/18 prices)"]
[null,"08/0","N/A","Chemicals",null,null,49,null,3,3650,"Shunter",0,null,"n/a",null,null,"08/0Chemicals",null,null,3.3107000000000002,3.2685]
[null,"08/0","N/A","Construction Materials",null,null,49,null,3,3650,"Shunter",0,null,"n/a",null,null,"08/0Construction Materials",null,null,3.4752999999999998,3.7421000000000002]
[null,"08/0","N/A","Domestic Intermodal",null,null,49,null,3,3650,"Shunter",0,null,"n/a",null,null,"08/0Domestic Intermodal",null,null,3.6787000000000001,3.8961999999999999]
[null,"08/0","N/A","Other",null,null,49,null,3,3650,"Shunter",0,null,"n/a",null,null,"08/0Other",null,null,3.4127999999999998,3.5916999999999999]
[null,"08/0","N/A","Petroleum",null,null,49,null,3,3650,"Shunter",0,null,"n/a",null,null,"08/0Petroleum",null,null,3.4026999999999998,3.5179999999999998]
[null,"20/0","N/A","Coal ESI",null,null,73,null,4,3810,"Loco2_50",0,null,"n/a","Moved from the 'not operated list' vice email from SLC operations via Ian Stone 23/9/22",null,"20/0Coal ESI",null,null,4.1338999999999997,6.0204000000000004]
[null,"20/0","N/A","Construction Materials",null,null,73,null,4,3810,"Loco2_50",0,null,"n/a",null,null,"20/0Construction Materials",null,null,4.2324999999999999,6.2251000000000003]
[null,"20/0","N/A","Enterprise",null,null,73,null,4,3810,"Loco2_50",0,null,"n/a","Moved from the 'not operated list' vice email from SLC operations via Ian Stone 23/9/22",null,"20/0Enterprise",null,null,4.3620999999999999,6.1421999999999999]
[null,"20/0","N/A","Other",null,null,73,null,4,3810,"Loco2_50",0,null,"n/a",null,null,"20/0Other",null,null,4.1806000000000001,6.0606]
[null,"20/3","N/A","Construction Materials",null,null,73,null,4,3810,"Loco2_50",0,null,"n/a",null,null,"20/3Construction Materials",null,null,4.2447999999999997,6.2251000000000003]
[null,"20/3","N/A","Domestic Intermodal",null,null,73,null,4,3810,"Loco2_50",0,null,"n/a","Moved from the 'not operated list' vice spreadhseet from DC Rail (Bruce Giles email 02.09.22)",null,"20/3Domestic Intermodal",null,null,4.4884000000000004,6.3948]
[null,"20/3","N/A","Mail and Premium Logistics",null,null,73,null,4,3810,"Loco2_50",0,null,"n/a","Moved from the 'not operated list' vice spreadhseet from DC Rail (Bruce Giles email 02.09.22)",null,"20/3Mail and Premium Logistics",null,null,5.6333000000000002,8.5962999999999994]
[null,"20/3","N/A","Other",null,null,73,null,4,3810,"Loco2_50",0,null,"n/a",null,null,"20/3Other",null,null,4.1929999999999996,6.0606]
[null,"20/3","N/A","Steel",null,null,73,null,4,3810,"Loco2_50",0,null,"n/a","Moved from the 'not operated list' vice spreadhseet from DC Rail (Bruce Giles email 02.09.22)",null,"20/3Steel",null,null,4.1929999999999996,6.0606]
[null,"20/9","N/A","Construction Materials",null,null,73,null,4,3810,"Loco2_50",0,null,"n/a",null,null,"20/9Construction Materials",null,null,4.2324999999999999,6.2251000000000003]
[null,"20/9","N/A","Other",null,null,73,null,4,3810,"Loco2_50",0,null,"n/a",null,null,"20/9Other",null,null,4.1806000000000001,6.0606]
[null,"26/1","N/A","Other",null,null,73,null,4,3500,"Loco2_50",0,null,"n/a",null,null,"26/1Other",null,null,4.1593,6.0468000000000002]
[null,"31/1","N/A","Construction Materials",null,null,107,null,6,3370,"Loco3_50",0,null,"n/a",null,null,"31/1Construction Materials",null,null,4.0885999999999996,5.8902000000000001]
[null,"31/1","N/A","Other",null,null,107,null,6,3370,"Loco3_50",0,null,"n/a",null,null,"31/1Other",null,null,4.0419,5.7413999999999996]
[null,"31/4","N/A","Other",null,null,107,null,6,3370,"Loco3_50",0,null,"n/a",null,null,"31/4Other",null,null,4.0419,5.7413999999999996]
[null,"33/0","N/A","Other",null,null,76,null,4,3500,"Loco2_50",0,null,"n/a",null,null,"33/0Other",null,null,3.8814000000000002,6.1189]
[null,"33/2","N/A","Other",null,null,76,null,6,3500,"Loco2_50",0,null,"n/a",null,null,"33/2Other",null,null,3.4565999999999999,4.8316999999999997]
[null,"37/0","N/A","Construction Materials",null,null,105,null,6,3238,"Loco3_50",0,null,"n/a",null,null,"37/0Construction Materials",null,null,4.0720000000000001,5.8559999999999999]
[null,"37/0","N/A","Domestic Automotive",null,null,105,null,6,3238,"Loco3_50",0,null,"n/a",null,null,"37/0Domestic Automotive",null,null,4.2019000000000002,5.7133000000000003]
[null,"37/0","N/A","Domestic Intermodal",null,null,105,null,6,3238,"Loco3_50",0,null,"n/a",null,null,"37/0Domestic Intermodal",null,null,4.2930000000000001,6.0033000000000003]
[null,"37/0","N/A","Enterprise",null,null,105,null,6,3238,"Loco3_50",0,null,"n/a",null,null,"37/0Enterprise",null,null,4.1940999999999997,5.7840999999999996]
[null,"37/0","N/A","European Intermodal",null,null,105,null,6,3238,"Loco3_50",0,null,"n/a",null,null,"37/0European Intermodal",null,null,4.3525,6.1935000000000002]
[null,"37/0","N/A","General Merchandise",null,null,105,null,6,3238,"Loco3_50",0,null,"n/a",null,null,"37/0General Merchandise",null,null,4.2282000000000002,5.8924000000000003]
[null,"37/0","N/A","Other",null,null,105,null,6,3238,"Loco3_50",0,null,"n/a",null,null,"37/0Other",null,null,4.0270000000000001,5.7133000000000003]
[null,"37/0","N/A","Petroleum",null,null,105,null,6,3238,"Loco3_50",0,null,"n/a",null,null,"37/0Petroleum",null,null,4.0050999999999997,5.6437999999999997]
[null,"37/0","N/A","Steel",null,null,105,null,6,3238,"Loco3_50",0,null,"n/a",null,null,"37/0Steel",null,null,4.0270999999999999,5.7133000000000003]
[null,"37/4","N/A","Biomass",null,null,107,null,6,3238,"Loco3_50",0,null,"n/a",null,null,"37/4Biomass",null,null,4.1364000000000001,6.0679999999999996]
[null,"37/4","N/A","Chemicals",null,null,107,null,6,3238,"Loco3_50",0,null,"n/a",null,null,"37/4Chemicals",null,null,3.9355000000000002,5.4295999999999998]
[null,"37/4","N/A","Construction Materials",null,null,107,null,6,3238,"Loco3_50",0,null,"n/a",null,null,"37/4Construction Materials",null,null,4.0776000000000003,5.8802000000000003]
[null,"37/4","N/A","Domestic Automotive",null,null,107,null,6,3238,"Loco3_50",0,null,"n/a",null,null,"37/4Domestic Automotive",null,null,4.2111000000000001,5.7354000000000003]
[null,"37/4","N/A","Domestic Intermodal",null,null,107,null,6,3238,"Loco3_50",0,null,"n/a",null,null,"37/4Domestic Intermodal",null,null,4.3033999999999999,6.0298999999999996]
[null,"37/4","N/A","European Intermodal",null,null,107,null,6,3238,"Loco3_50",0,null,"n/a",null,null,"37/4European Intermodal",null,null,4.3636999999999997,6.2233999999999998]
[null,"37/4","N/A","Other",null,null,107,null,6,3238,"Loco3_50",0,null,"n/a",null,null,"37/4Other",null,null,4.0320999999999998,5.7354000000000003]
[null,"37/4","N/A","Petroleum",null,null,107,null,6,3238,"Loco3_50",0,null,"n/a",null,null,"37/4Petroleum",null,null,4.01,5.665]
[null,"37/5","N/A","General Merchandise",null,null,107,null,6,3238,"Loco3_50",0,null,"n/a",null,null,"37/5General Merchandise",null,null,4.2370000000000001,5.9172000000000002]
[null,"37/5","N/A","Other",null,null,107,null,6,3238,"Loco3_50",0,null,"n/a",null,null,"37/5Other",null,null,4.0320999999999998,5.7354000000000003]
[null,"37/5","N/A","Petroleum",null,null,107,null,6,3238,"Loco3_50",0,null,"n/a",null,null,"37/5Petroleum",null,null,4.01,5.665]
[null,"37/5","N/A","Steel",null,null,107,null,6,3238,"Loco3_50",0,null,"n/a",null,null,"37/5Steel",null,null,4.0320999999999998,5.7354000000000003]
[null,"37/6","N/A","Chemicals",null,null,105,null,6,3238,"Loco3_50",0,null,"n/a",null,null,"37/6Chemicals",null,null,3.9312999999999998,5.4111000000000002]
[null,"37/6","N/A","Construction Materials",null,null,105,null,6,3238,"Loco3_50",0,null,"n/a",null,null,"37/6Construction Materials",null,null,4.0720000000000001,5.8559999999999999]
[null,"37/6","N/A","Domestic Intermodal",null,null,105,null,6,3238,"Loco3_50",0,null,"n/a",null,null,"37/6Domestic Intermodal",null,null,4.2930000000000001,6.0033000000000003]
[null,"37/6","N/A","Domestic Waste",null,null,105,null,6,3238,"Loco3_50",0,null,"n/a",null,null,"37/6Domestic Waste",null,null,4.1604000000000001,5.6783999999999999]
[null,"37/6","N/A","Enterprise",null,null,105,null,6,3238,"Loco3_50",0,null,"n/a",null,null,"37/6Enterprise",null,null,4.1936999999999998,5.7840999999999996]
[null,"37/6","N/A","General Merchandise",null,null,105,null,6,3238,"Loco3_50",0,null,"n/a",null,null,"37/6General Merchandise",null,null,4.2276999999999996,5.8924000000000003]
[null,"37/6","N/A","Other",null,null,105,null,6,3238,"Loco3_50",0,null,"n/a",null,null,"37/6Other",null,null,4.0270000000000001,5.7133000000000003]
[null,"37/7","N/A","Construction Materials",null,null,105,null,6,3238,"Loco3_50",0,null,"n/a",null,null,"37/7Construction Materials"]
[null,"37/7","N/A","Other",null,null,105,null,6,3238,"Loco3_50",0,null,"n/a",null,null,"37/7Other",null,null,4.0270000000000001,5.7133000000000003]
[null,"43/0","N/A","Other",null,null,73.25,null,4,2200,"Loco2_50",0,null,"n/a",null,null,"43/0Other"]
[null,"47/2","N/A","Domestic Intermodal",null,null,114,null,6,3487,"Loco3_50",0,null,"n/a",null,null,"47/2Domestic Intermodal",null,null,4.3925999999999998,6.1912000000000003]
[null,"47/2","N/A","Other",null,null,114,null,6,3487,"Loco3_50",0,null,"n/a",null,null,"47/2Other",null,null,4.1071999999999997,5.8639999999999999]
[null,"47/4","N/A","Coal ESI",null,null,119,null,6,3487,"Loco3_50",0,null,"n/a",null,null,"47/4Coal ESI",null,null,4.1113,5.9452999999999996]
[null,"47/4","N/A","Construction Materials",null,null,119,null,6,3487,"Loco3_50",0,null,"n/a",null,null,"47/4Construction Materials",null,null,4.1931000000000003,6.1543999999999999]
[null,"47/4","N/A","Domestic Automotive",null,null,119,null,6,3487,"Loco3_50",0,null,"n/a",null,null,"47/4Domestic Automotive",null,null,4.3503999999999996,5.9863]
[null,"47/4","N/A","Domestic Intermodal",null,null,119,null,6,3487,"Loco3_50",0,null,"n/a",null,null,"47/4Domestic Intermodal",null,null,4.4538000000000002,6.3292000000000002]
[null,"47/4","N/A","Domestic Waste",null,null,119,null,6,3487,"Loco3_50",0,null,"n/a",null,null,"47/4Domestic Waste",null,null,4.2988,5.9452999999999996]
[null,"47/4","N/A","General Merchandise",null,null,119,null,6,3487,"Loco3_50",0,null,"n/a",null,null,"47/4General Merchandise",null,null,4.3760000000000003,6.1974999999999998]
[null,"47/4","N/A","Iron Ore",null,null,119,null,6,3487,"Loco3_50",0,null,"n/a",null,null,"47/4Iron Ore",null,null,4.1010999999999997,5.9863]
[null,"47/4","N/A","Other",null,null,119,null,6,3487,"Loco3_50",0,null,"n/a",null,null,"47/4Other",null,null,4.1406999999999998,5.9863]
[null,"47/7","N/A","Biomass",null,null,119,null,6,3487,"Loco3_50",0,null,"n/a",null,null,"47/7Biomass",null,null,4.2579000000000002,6.3739999999999997]
[null,"47/7","N/A","Coal ESI",null,null,119,null,6,3487,"Loco3_50",0,null,"n/a",null,null,"47/7Coal ESI",null,null,4.0883000000000003,5.9452999999999996]
[null,"47/7","N/A","Coal Other",null,null,119,null,6,3487,"Loco3_50",0,null,"n/a","Moved from the 'not operated list' vice email from SLC operations via Ian Stone 23/9/22",null,"47/7Coal Other",null,null,4.1383999999999999,5.9863]
[null,"47/7","N/A","Construction Materials",null,null,119,null,6,3487,"Loco3_50",0,null,"n/a",null,null,"47/7Construction Materials",null,null,4.1902999999999997,6.1543999999999999]
[null,"47/7","N/A","Domestic Intermodal",null,null,119,null,6,3487,"Loco3_50",0,null,"n/a",null,null,"47/7Domestic Intermodal",null,null,4.4531000000000001,6.3292000000000002]
[null,"47/7","N/A","Domestic Waste",null,null,119,null,6,3487,"Loco3_50",0,null,"n/a",null,null,"47/7Domestic Waste",null,null,4.2980999999999998,5.9452999999999996]
[null,"47/7","N/A","Enterprise",null,null,119,null,6,3487,"Loco3_50",0,null,"n/a","Moved from the 'not operated list' vice email from SLC operations via Ian Stone 23/9/22",null,"47/7Enterprise",null,null,4.3365,6.0694999999999997]
[null,"47/7","N/A","Other",null,null,119,null,6,3487,"Loco3_50",0,null,"n/a",null,null,"47/7Other",null,null,4.1384999999999996,5.9863]
[null,"47/7","N/A","Petroleum",null,null,119,null,6,3487,"Loco3_50",0,null,"n/a",null,null,"47/7Petroleum",null,null,4.1131000000000002,5.9048999999999996]
[null,"47/7","N/A","Steel",null,null,119,null,6,3487,"Loco3_50",0,null,"n/a",null,null,"47/7Steel",null,null,4.1383999999999999,5.9863]
[null,"50/0","N/A","Other",null,null,117,null,6,3487,"Loco3_50",0,null,"n/a",null,null,"50/0Other",null,null,4.117,5.9335000000000004]
[null,"56/0","N/A","Biomass",null,null,128,null,6,4049.0000000000005,"Loco3_50",0,null,"n/a","Keep as per DC Rail excel",null,"56/0Biomass",null,null,4.4481000000000002,6.7691999999999997]
[null,"56/0","N/A","Chemicals",null,null,128,null,6,4049.0000000000005,"Loco3_50",0,null,"n/a","Keep as per DC Rail excel",null,"56/0Chemicals",null,null,4.1795,5.8970000000000002]
[null,"56/0","N/A","Coal ESI",null,null,128,null,6,4049.0000000000005,"Loco3_50",0,null,"n/a",null,null,"56/0Coal ESI",null,null,4.25,6.2618999999999998]
[null,"56/0","N/A","Coal Other",null,null,128,null,6,4049.0000000000005,"Loco3_50",0,null,"n/a","Keep as per DC Rail excel",null,"56/0Coal Other",null,null,4.3074000000000003,6.3102999999999998]
[null,"56/0","N/A","Construction Materials",null,null,128,null,6,4049.0000000000005,"Loco3_50",0,null,"n/a",null,null,"56/0Construction Materials",null,null,4.3685,6.5091000000000001]
[null,"56/0","N/A","Domestic Automotive",null,null,128,null,6,4049.0000000000005,"Loco3_50",0,null,"n/a",null,null,"56/0Domestic Automotive",null,null,4.5458999999999996,6.3102999999999998]
[null,"56/0","N/A","Domestic Intermodal",null,null,128,null,6,4049.0000000000005,"Loco3_50",0,null,"n/a",null,null,"56/0Domestic Intermodal",null,null,4.6704999999999997,6.7161999999999997]
[null,"56/0","N/A","Domestic Waste",null,null,128,null,6,4049.0000000000005,"Loco3_50",0,null,"n/a",null,null,"56/0Domestic Waste",null,null,4.4892000000000003,6.2618999999999998]
[null,"56/0","N/A","Enterprise",null,null,128,null,6,4049.0000000000005,"Loco3_50",0,null,"n/a",null,null,"56/0Enterprise",null,null,4.5342000000000002,6.4085999999999999]
[null,"56/0","N/A","European Automotive",null,null,128,null,6,4049.0000000000005,"Loco3_50",0,null,"n/a","Keep as per DC Rail excel",null,"56/0European Automotive",null,null,4.6384999999999996,6.6116000000000001]
[null,"56/0","N/A","European Conventional",null,null,128,null,6,4049.0000000000005,"Loco3_50",0,null,"n/a","Keep as per DC Rail excel",null,"56/0European Conventional",null,null,4.5965999999999996,6.6116000000000001]
[null,"56/0","N/A","European Intermodal",null,null,128,null,6,4049.0000000000005,"Loco3_50",0,null,"n/a",null,null,"56/0European Intermodal",null,null,4.7527999999999997,6.9862000000000002]
[null,"56/0","N/A","General Merchandise",null,null,128,null,6,4049.0000000000005,"Loco3_50",0,null,"n/a",null,null,"56/0General Merchandise",null,null,4.5808,6.5601000000000003]
[null,"56/0","N/A","Industrial Minerals",null,null,128,null,6,4049.0000000000005,"Loco3_50",0,null,"n/a",null,null,"56/0Industrial Minerals",null,null,4.2066999999999997,5.9844999999999997]
[null,"56/0","N/A","Iron Ore",null,null,128,null,6,4049.0000000000005,"Loco3_50",0,null,"n/a","Keep as per DC Rail excel",null,"56/0Iron Ore",null,null,4.2648000000000001,6.3102999999999998]
[null,"56/0","N/A","Mail and Premium Logistics",null,null,128,null,6,4049.0000000000005,"Loco3_50",0,null,"n/a","Keep as per DC Rail excel",null,"56/0Mail and Premium Logistics",null,null,6.0862999999999996,9.5136000000000003]
[null,"56/0","N/A","Other",null,null,128,null,6,4049.0000000000005,"Loco3_50",0,null,"n/a",null,null,"56/0Other",null,null,4.3074000000000003,6.3102999999999998]
[null,"56/0","N/A","Petroleum",null,null,128,null,6,4049.0000000000005,"Loco3_50",0,null,"n/a",null,null,"56/0Petroleum",null,null,4.2778,6.2141999999999999]
[null,"56/0","N/A","Royal Mail",null,null,128,null,6,4049.0000000000005,"Loco3_50",0,null,"n/a","Keep as per DC Rail excel",null,"56/0Royal Mail",null,null,6.0862999999999996,9.5136000000000003]
[null,"56/0","N/A","Steel",null,null,128,null,6,4049.0000000000005,"Loco3_50",0,null,"n/a",null,null,"56/0Steel",null,null,4.3074000000000003,6.3102999999999998]
[null,"57/0","N/A","Biomass",null,null,114,null,6,3487,"Loco3_50",0,null,"n/a","GBRf request to be retained  - Use of Cl.57/0 as banking engine on Liv - Drax",null,"57/0Biomass",null,null,4.2047999999999996,6.2336999999999998]
[null,"57/0","N/A","Construction Materials",null,null,114,null,6,3487,"Loco3_50",0,null,"n/a",null,null,"57/0Construction Materials",null,null,4.1398999999999999,6.0247000000000002]
[null,"57/0","N/A","Domestic Automotive",null,null,114,null,6,3487,"Loco3_50",0,null,"n/a",null,null,"57/0Domestic Automotive",null,null,4.2865000000000002,5.8639999999999999]
[null,"57/0","N/A","Domestic Intermodal",null,null,114,null,6,3487,"Loco3_50",0,null,"n/a",null,null,"57/0Domestic Intermodal",null,null,4.3882000000000003,6.1912000000000003]
[null,"57/0","N/A","Other",null,null,114,null,6,3487,"Loco3_50",0,null,"n/a",null,null,"57/0Other",null,null,4.0899000000000001,5.8639999999999999]
[null,"57/3","N/A","Construction Materials",null,null,117,null,6,3487,"Loco3_50",0,null,"n/a",null,null,"57/3Construction Materials",null,null,4.1680999999999999,6.0984999999999996]
[null,"57/3","N/A","Domestic Automotive",null,null,117,null,6,3487,"Loco3_50",0,null,"n/a",null,null,"57/3Domestic Automotive",null,null,4.3209,5.9335000000000004]
[null,"57/3","N/A","Domestic Intermodal",null,null,117,null,6,3487,"Loco3_50",0,null,"n/a",null,null,"57/3Domestic Intermodal",null,null,4.4249999999999998,6.2698999999999998]
[null,"57/3","N/A","Mail and Premium Logistics",null,null,117,null,6,3487,"Loco3_50",0,null,"n/a",null,null,"57/3Mail and Premium Logistics",null,null,5.6009000000000002,8.5543999999999993]
[null,"57/3","N/A","Other",null,null,117,null,6,3487,"Loco3_50",0,null,"n/a",null,null,"57/3Other",null,null,4.117,5.9335000000000004]
[null,"57/3","N/A","Royal Mail",null,null,117,null,6,3487,"Loco3_50",0,null,"n/a","Retain. Possible use, if GBRf are awarded contract.",null,"57/3Royal Mail",null,null,5.6009000000000002,8.5543999999999993]
[null,"59/0","N/A","Biomass",null,null,126,null,6,3613,"Loco3_50",0,null,"n/a",null,null,"59/0Biomass",null,null,4.3735999999999997,6.6420000000000003]
[null,"59/0","N/A","Construction Materials",null,null,126,null,6,3613,"Loco3_50",0,null,"n/a",null,null,"59/0Construction Materials",null,null,4.3,6.4009999999999998]
[null,"59/0","N/A","Domestic Automotive",null,null,126,null,6,3613,"Loco3_50",0,null,"n/a",null,null,"59/0Domestic Automotive",null,null,4.4729000000000001,6.2171000000000003]
[null,"59/0","N/A","Domestic Intermodal",null,null,126,null,6,3613,"Loco3_50",0,null,"n/a",null,null,"59/0Domestic Intermodal",null,null,4.5879000000000003,6.5929000000000002]
[null,"59/0","N/A","Domestic Waste",null,null,126,null,6,3613,"Loco3_50",0,null,"n/a",null,null,"59/0Domestic Waste",null,null,4.4189999999999996,6.1725000000000003]
[null,"59/0","N/A","Enterprise",null,null,126,null,6,3613,"Loco3_50",0,null,"n/a",null,null,"59/0Enterprise",null,null,4.4606000000000003,6.3080999999999996]
[null,"59/0","N/A","Industrial Minerals",null,null,126,null,6,3613,"Loco3_50",0,null,"n/a",null,null,"59/0Industrial Minerals",null,null,4.1510999999999996,5.9164000000000003]
[null,"59/0","N/A","Other",null,null,126,null,6,3613,"Loco3_50",0,null,"n/a",null,null,"59/0Other",null,null,4.2436999999999996,6.2171000000000003]
[null,"59/0","N/A","Petroleum",null,null,126,null,6,3613,"Loco3_50",0,null,"n/a",null,null,"59/0Petroleum",null,null,4.2164999999999999,6.1284000000000001]
[null,"59/1","N/A","Construction Materials",null,null,126,null,6,3613,"Loco3_50",0,null,"n/a",null,null,"59/1Construction Materials",null,null,4.3,6.4009999999999998]
[null,"59/1","N/A","Domestic Waste",null,null,126,null,6,3613,"Loco3_50",0,null,"n/a",null,null,"59/1Domestic Waste",null,null,4.4189999999999996,6.1725000000000003]
[null,"59/1","N/A","Enterprise",null,null,126,null,6,3613,"Loco3_50",0,null,"n/a",null,null,"59/1Enterprise",null,null,4.4606000000000003,6.3080999999999996]
[null,"59/1","N/A","Industrial Minerals",null,null,126,null,6,3613,"Loco3_50",0,null,"n/a",null,null,"59/1Industrial Minerals",null,null,4.1510999999999996,5.9164000000000003]
[null,"59/1","N/A","Other",null,null,126,null,6,3613,"Loco3_50",0,null,"n/a",null,null,"59/1Other",null,null,4.2436999999999996,6.2171000000000003]
[null,"59/2","N/A","Construction Materials",null,null,126,null,6,3613,"Loco3_50",0,null,"n/a",null,null,"59/2Construction Materials",null,null,4.3,6.4009999999999998]
[null,"59/2","N/A","Domestic Intermodal",null,null,126,null,6,3613,"Loco3_50",0,null,"n/a",null,null,"59/2Domestic Intermodal",null,null,4.5879000000000003,6.5929000000000002]
[null,"59/2","N/A","Domestic Waste",null,null,126,null,6,3613,"Loco3_50",0,null,"n/a",null,null,"59/2Domestic Waste",null,null,4.4189999999999996,6.1725000000000003]
[null,"59/2","N/A","Enterprise",null,null,126,null,6,3613,"Loco3_50",0,null,"n/a",null,null,"59/2Enterprise",null,null,4.4606000000000003,6.3080999999999996]
[null,"59/2","N/A","European Intermodal",null,null,126,null,6,3613,"Loco3_50",0,null,"n/a",null,null,"59/2European Intermodal",null,null,4.6639999999999997,6.8430999999999997]
[null,"59/2","N/A","Other",null,null,126,null,6,3613,"Loco3_50",0,null,"n/a",null,null,"59/2Other",null,null,4.2436999999999996,6.2171000000000003]
[null,"59/2","N/A","Steel",null,null,126,null,6,3613,"Loco3_50",0,null,"n/a",null,null,"59/2Steel",null,null,4.2436999999999996,6.2171000000000003]
[null,"60/0","N/A","Biomass",null,null,129,null,6,3867,"Class_60",0,null,"n/a",null,null,"60/0Biomass",null,null,3.7176999999999998,5.7110000000000003]
[null,"60/0","N/A","Chemicals",null,null,129,null,6,3867,"Class_60",0,null,"n/a",null,null,"60/0Chemicals",null,null,3.4577,4.8509000000000002]
[null,"60/0","N/A","Coal ESI",null,null,129,null,6,3867,"Class_60",0,null,"n/a",null,null,"60/0Coal ESI",null,null,3.5257000000000001,5.2099000000000002]
[null,"60/0","N/A","Coal Other",null,null,129,null,6,3867,"Class_60",0,null,"n/a",null,null,"60/0Coal Other",null,null,3.5830000000000002,5.2575000000000003]
[null,"60/0","N/A","Construction Materials",null,null,129,null,6,3867,"Class_60",0,null,"n/a",null,null,"60/0Construction Materials",null,null,3.6431,5.4538000000000002]
[null,"60/0","N/A","Domestic Automotive",null,null,129,null,6,3867,"Class_60",0,null,"n/a",null,null,"60/0Domestic Automotive",null,null,3.8254000000000001,5.2575000000000003]
[null,"60/0","N/A","Domestic Intermodal",null,null,129,null,6,3867,"Class_60",0,null,"n/a",null,null,"60/0Domestic Intermodal",null,null,3.9472999999999998,5.6585999999999999]
[null,"60/0","N/A","Domestic Waste",null,null,129,null,6,3867,"Class_60",0,null,"n/a",null,null,"60/0Domestic Waste",null,null,3.7679999999999998,5.2099000000000002]
[null,"60/0","N/A","Enterprise",null,null,129,null,6,3867,"Class_60",0,null,"n/a",null,null,"60/0Enterprise",null,null,3.8123999999999998,5.3544999999999998]
[null,"60/0","N/A","European Automotive",null,null,129,null,6,3867,"Class_60",0,null,"n/a","Retained as per DC Rail spreadsheet",null,"60/0European Automotive",null,null,3.9177,5.5551000000000004]
[null,"60/0","N/A","European Conventional",null,null,129,null,6,3867,"Class_60",0,null,"n/a",null,null,"60/0European Conventional",null,null,3.8732000000000002,5.5551000000000004]
[null,"60/0","N/A","European Intermodal",null,null,129,null,6,3867,"Class_60",0,null,"n/a",null,null,"60/0European Intermodal",null,null,4.0288000000000004,5.9257999999999997]
[null,"60/0","N/A","General Merchandise",null,null,129,null,6,3867,"Class_60",0,null,"n/a","Retained as per DC Rail spreadsheet",null,"60/0General Merchandise",null,null,3.8580999999999999,5.5042]
[null,"60/0","N/A","Industrial Minerals",null,null,129,null,6,3867,"Class_60",0,null,"n/a",null,null,"60/0Industrial Minerals",null,null,3.4843999999999999,4.9367000000000001]
[null,"60/0","N/A","Iron Ore",null,null,129,null,6,3867,"Class_60",0,null,"n/a",null,null,"60/0Iron Ore",null,null,3.5400999999999998,5.2575000000000003]
[null,"60/0","N/A","Mail and Premium Logistics",null,null,129,null,6,3867,"Class_60",0,null,"n/a","Retained as per DC Rail spreadsheet",null,"60/0Mail and Premium Logistics",null,null,5.3653000000000004,8.4404000000000003]
[null,"60/0","N/A","Other",null,null,129,null,6,3867,"Class_60",0,null,"n/a",null,null,"60/0Other",null,null,3.5832999999999999,5.2575000000000003]
[null,"60/0","N/A","Petroleum",null,null,129,null,6,3867,"Class_60",0,null,"n/a",null,null,"60/0Petroleum",null,null,3.5535000000000001,5.1627999999999998]
[null,"60/0","N/A","Royal Mail",null,null,129,null,6,3867,"Class_60",0,null,"n/a","Retained as per DC Rail spreadsheet",null,"60/0Royal Mail",null,null,5.3552,8.4404000000000003]
[null,"60/0","N/A","Steel",null,null,129,null,6,3867,"Class_60",0,null,"n/a",null,null,"60/0Steel",null,null,3.5830000000000002,5.2575000000000003]
[null,"66/0","N/A","Biomass",null,null,126,null,6,3552,"Class_66",0,null,"n/a",null,null,"66/0Biomass",null,null,2.7382,4.1607000000000003]
[null,"66/0","N/A","Chemicals",null,null,126,null,6,3552,"Class_66",0,null,"n/a",null,null,"66/0Chemicals",null,null,2.4931000000000001,3.3616999999999999]
[null,"66/0","N/A","Coal ESI",null,null,126,null,6,3552,"Class_66",0,null,"n/a",null,null,"66/0Coal ESI",null,null,2.5550999999999999,3.6951000000000001]
[null,"66/0","N/A","Coal Other",null,null,126,null,6,3552,"Class_66",0,null,"n/a",null,null,"66/0Coal Other",null,null,2.6093999999999999,3.7393999999999998]
[null,"66/0","N/A","Construction Materials",null,null,126,null,6,3552,"Class_66",0,null,"n/a",null,null,"66/0Construction Materials",null,null,2.6652999999999998,3.9217]
[null,"66/0","N/A","Domestic Automotive",null,null,126,null,6,3552,"Class_66",0,null,"n/a",null,null,"66/0Domestic Automotive",null,null,2.8382999999999998,3.7393999999999998]
[null,"66/0","N/A","Domestic Intermodal",null,null,126,null,6,3552,"Class_66",0,null,"n/a",null,null,"66/0Domestic Intermodal",null,null,2.9521000000000002,4.1120000000000001]
[null,"66/0","N/A","Domestic Waste",null,null,126,null,6,3552,"Class_66",0,null,"n/a",null,null,"66/0Domestic Waste",null,null,2.7846000000000002,3.6951000000000001]
[null,"66/0","N/A","Enterprise",null,null,126,null,6,3552,"Class_66",0,null,"n/a",null,null,"66/0Enterprise",null,null,2.8256999999999999,3.8294999999999999]
[null,"66/0","N/A","European Automotive",null,null,126,null,6,3552,"Class_66",0,null,"n/a",null,null,"66/0European Automotive",null,null,2.9228999999999998,4.0159000000000002]
[null,"66/0","N/A","European Conventional",null,null,126,null,6,3552,"Class_66",0,null,"n/a",null,null,"66/0European Conventional",null,null,2.8826000000000001,4.0159000000000002]
[null,"66/0","N/A","European Intermodal",null,null,126,null,6,3552,"Class_66",0,null,"n/a",null,null,"66/0European Intermodal",null,null,3.0276000000000001,4.3602999999999996]
[null,"66/0","N/A","General Merchandise",null,null,126,null,6,3552,"Class_66",0,null,"n/a",null,null,"66/0General Merchandise",null,null,2.8681999999999999,3.9685000000000001]
[null,"66/0","N/A","Industrial Minerals",null,null,126,null,6,3552,"Class_66",0,null,"n/a",null,null,"66/0Industrial Minerals",null,null,2.5177999999999998,3.4413999999999998]
[null,"66/0","N/A","Iron Ore",null,null,126,null,6,3552,"Class_66",0,null,"n/a",null,null,"66/0Iron Ore",null,null,2.5688,3.7393999999999998]
[null,"66/0","N/A","Other",null,null,126,null,6,3552,"Class_66",0,null,"n/a",null,null,"66/0Other",null,null,2.6095000000000002,3.7393999999999998]
[null,"66/0","N/A","Petroleum",null,null,126,null,6,3552,"Class_66",0,null,"n/a",null,null,"66/0Petroleum",null,null,2.5825,3.6514000000000002]
[null,"66/0","N/A","Royal Mail",null,null,126,null,6,3552,"Class_66",0,null,"n/a",null,null,"66/0Royal Mail",null,null,4.2766999999999999,6.6980000000000004]
[null,"66/0","N/A","Steel",null,null,126,null,6,3552,"Class_66",0,null,"n/a",null,null,"66/0Steel",null,null,2.6095000000000002,3.7393999999999998]
[null,"66/3","N/A","Biomass",null,null,127,null,6,3552,"Class_66",0,null,"n/a","Retain. GBRf now operating 66301 - 66305.",null,"66/3Biomass",null,null,2.7686999999999999,4.2225000000000001]
[null,"66/3","N/A","Coal ESI",null,null,127,null,6,3552,"Class_66",0,null,"n/a","Retain. GBRf now operating 66301 - 66305.",null,"66/3Coal ESI",null,null,2.5739000000000001,3.7517]
[null,"66/3","N/A","Coal Other",null,null,127,null,6,3552,"Class_66",0,null,"n/a","Retain. GBRf now operating 66301 - 66305.",null,"66/3Coal Other",null,null,2.6282999999999999,3.7964000000000002]
[null,"66/3","N/A","Construction Materials",null,null,127,null,6,3552,"Class_66",0,null,"n/a",null,null,"66/3Construction Materials",null,null,2.6846999999999999,3.9807000000000001]
[null,"66/3","N/A","Domestic Automotive",null,null,127,null,6,3552,"Class_66",0,null,"n/a",null,null,"66/3Domestic Automotive",null,null,2.8571,3.7964000000000002]
[null,"66/3","N/A","Domestic Intermodal",null,null,127,null,6,3552,"Class_66",0,null,"n/a",null,null,"66/3Domestic Intermodal",null,null,2.972,4.1731999999999996]
[null,"66/3","N/A","Domestic Waste",null,null,127,null,6,3552,"Class_66",0,null,"n/a","Retain. GBRf now operating 66301 - 66305.",null,"66/3Domestic Waste",null,null,2.8031999999999999,3.7517]
[null,"66/3","N/A","European Automotive",null,null,127,null,6,3552,"Class_66",0,null,"n/a","Retain. GBRf now operating 66301 - 66305.",null,"66/3European Automotive",null,null,2.9424000000000001,4.0759999999999996]
[null,"66/3","N/A","European Conventional",null,null,127,null,6,3552,"Class_66",0,null,"n/a","Retain. GBRf now operating 66301 - 66305.",null,"66/3European Conventional",null,null,2.9022999999999999,4.0759999999999996]
[null,"66/3","N/A","European Intermodal",null,null,127,null,6,3552,"Class_66",0,null,"n/a","Retain. GBRf now operating 66301 - 66305.",null,"66/3European Intermodal",null,null,3.0482999999999998,4.4245000000000001]
[null,"66/3","N/A","General Merchandise",null,null,127,null,6,3552,"Class_66",0,null,"n/a","Retain. GBRf now operating 66301 - 66305.",null,"66/3General Merchandise",null,null,2.8877000000000002,4.0281000000000002]
[null,"66/3","N/A","Industrial Minerals",null,null,127,null,6,3552,"Class_66",0,null,"n/a","Retain. GBRf now operating 66301 - 66305.",null,"66/3Industrial Minerals",null,null,2.5358999999999998,3.4954999999999998]
[null,"66/3","N/A","Iron Ore",null,null,127,null,6,3552,"Class_66",0,null,"n/a","Retain. GBRf now operating 66301 - 66305.",null,"66/3Iron Ore",null,null,2.5876000000000001,3.7964000000000002]
[null,"66/3","N/A","Mail and Premium Logistics",null,null,127,null,6,3552,"Class_66",0,null,"n/a","Retain. GBRf now operating 66301 - 66305.",null,"66/3Mail and Premium Logistics",null,null,4.306,6.7942999999999998]
[null,"66/3","N/A","Other",null,null,127,null,6,3552,"Class_66",0,null,"n/a",null,null,"66/3Other",null,null,2.6282999999999999,3.7964000000000002]
[null,"66/3","N/A","Petroleum",null,null,127,null,6,3552,"Class_66",0,null,"n/a","Retain. GBRf now operating 66301 - 66305.",null,"66/3Petroleum",null,null,2.6012,3.7075999999999998]
[null,"66/3","N/A","Royal Mail",null,null,127,null,6,3552,"Class_66",0,null,"n/a","Retain. GBRf now operating 66301 - 66305.",null,"66/3Royal Mail",null,null,4.3274999999999997,6.7942999999999998]
[null,"66/3","N/A","Steel",null,null,127,null,6,3552,"Class_66",0,null,"n/a",null,null,"66/3Steel",null,null,2.6282999999999999,3.7964000000000002]
[null,"66/4","N/A","Biomass",null,null,127,null,6,3552,"Class_66",0,null,"n/a",null,null,"66/4Biomass",null,null,2.7686999999999999,4.2225000000000001]
[null,"66/4","N/A","Chemicals",null,null,127,null,6,3552,"Class_66",0,null,"n/a",null,null,"66/4Chemicals",null,null,2.5215000000000001,3.4150999999999998]
[null,"66/4","N/A","Coal ESI",null,null,127,null,6,3552,"Class_66",0,null,"n/a",null,null,"66/4Coal ESI",null,null,2.5838000000000001,3.7517]
[null,"66/4","N/A","Coal Other",null,null,127,null,6,3552,"Class_66",0,null,"n/a",null,null,"66/4Coal Other",null,null,2.6387999999999998,3.7964000000000002]
[null,"66/4","N/A","Construction Materials",null,null,127,null,6,3552,"Class_66",0,null,"n/a",null,null,"66/4Construction Materials",null,null,2.6951000000000001,3.9807000000000001]
[null,"66/4","N/A","Domestic Automotive",null,null,127,null,6,3552,"Class_66",0,null,"n/a",null,null,"66/4Domestic Automotive",null,null,2.8704999999999998,3.7964000000000002]
[null,"66/4","N/A","Domestic Intermodal",null,null,127,null,6,3552,"Class_66",0,null,"n/a",null,null,"66/4Domestic Intermodal",null,null,2.9855,4.1731999999999996]
[null,"66/4","N/A","Domestic Waste",null,null,127,null,6,3552,"Class_66",0,null,"n/a",null,null,"66/4Domestic Waste",null,null,2.8161,3.7517]
[null,"66/4","N/A","Enterprise",null,null,127,null,6,3552,"Class_66",0,null,"n/a",null,null,"66/4Enterprise",null,null,2.8576000000000001,3.8875000000000002]
[null,"66/4","N/A","European Conventional",null,null,127,null,6,3552,"Class_66",0,null,"n/a",null,null,"66/4European Conventional",null,null,2.9150999999999998,4.0759999999999996]
[null,"66/4","N/A","European Intermodal",null,null,127,null,6,3552,"Class_66",0,null,"n/a",null,null,"66/4European Intermodal",null,null,3.0617000000000001,4.4245000000000001]
[null,"66/4","N/A","Industrial Minerals",null,null,127,null,6,3552,"Class_66",0,null,"n/a",null,null,"66/4Industrial Minerals",null,null,2.5464000000000002,3.4954999999999998]
[null,"66/4","N/A","Iron Ore",null,null,127,null,6,3552,"Class_66",0,null,"n/a",null,null,"66/4Iron Ore",null,null,2.5975999999999999,3.7964000000000002]
[null,"66/4","N/A","Other",null,null,127,null,6,3552,"Class_66",0,null,"n/a",null,null,"66/4Other",null,null,2.6387999999999998,3.7964000000000002]
[null,"66/4","N/A","Petroleum",null,null,127,null,6,3552,"Class_66",0,null,"n/a",null,null,"66/4Petroleum",null,null,2.6114999999999999,3.7075999999999998]
[null,"66/4","N/A","Steel",null,null,127,null,6,3552,"Class_66",0,null,"n/a",null,null,"66/4Steel",null,null,2.6387999999999998,3.7964000000000002]
[null,"66/5","N/A","Biomass",null,null,127,null,6,3552,"Class_66",0,null,"n/a",null,null,"66/5Biomass",null,null,2.7686999999999999,4.2225000000000001]
[null,"66/5","N/A","Chemicals",null,null,127,null,6,3552,"Class_66",0,null,"n/a",null,null,"66/5Chemicals",null,null,2.5215000000000001,3.4150999999999998]
[null,"66/5","N/A","Coal ESI",null,null,127,null,6,3552,"Class_66",0,null,"n/a",null,null,"66/5Coal ESI",null,null,2.5838000000000001,3.7517]
[null,"66/5","N/A","Coal Other",null,null,127,null,6,3552,"Class_66",0,null,"n/a",null,null,"66/5Coal Other",null,null,2.6387999999999998,3.7964000000000002]
[null,"66/5","N/A","Construction Materials",null,null,127,null,6,3552,"Class_66",0,null,"n/a",null,null,"66/5Construction Materials",null,null,2.6951000000000001,3.9807000000000001]
[null,"66/5","N/A","Domestic Automotive",null,null,127,null,6,3552,"Class_66",0,null,"n/a",null,null,"66/5Domestic Automotive",null,null,2.8706,3.7964000000000002]
[null,"66/5","N/A","Domestic Intermodal",null,null,127,null,6,3552,"Class_66",0,null,"n/a",null,null,"66/5Domestic Intermodal",null,null,2.9855,4.1731999999999996]
[null,"66/5","N/A","Domestic Waste",null,null,127,null,6,3552,"Class_66",0,null,"n/a",null,null,"66/5Domestic Waste",null,null,2.8161,3.7517]
[null,"66/5","N/A","Enterprise",null,null,127,null,6,3552,"Class_66",0,null,"n/a",null,null,"66/5Enterprise",null,null,2.8576999999999999,3.8875000000000002]
[null,"66/5","N/A","European Conventional",null,null,127,null,6,3552,"Class_66",0,null,"n/a",null,null,"66/5European Conventional",null,null,2.9150999999999998,4.0759999999999996]
[null,"66/5","N/A","European Intermodal",null,null,127,null,6,3552,"Class_66",0,null,"n/a",null,null,"66/5European Intermodal",null,null,3.0617999999999999,4.4245000000000001]
[null,"66/5","N/A","Industrial Minerals",null,null,127,null,6,3552,"Class_66",0,null,"n/a",null,null,"66/5Industrial Minerals",null,null,2.5463,3.4954999999999998]
[null,"66/5","N/A","Iron Ore",null,null,127,null,6,3552,"Class_66",0,null,"n/a",null,null,"66/5Iron Ore",null,null,2.5975999999999999,3.7964000000000002]
[null,"66/5","N/A","Other",null,null,127,null,6,3552,"Class_66",0,null,"n/a",null,null,"66/5Other",null,null,2.6387999999999998,3.7964000000000002]
[null,"66/5","N/A","Petroleum",null,null,127,null,6,3552,"Class_66",0,null,"n/a",null,null,"66/5Petroleum",null,null,2.6114999999999999,3.7075999999999998]
[null,"66/5","N/A","Royal Mail",null,null,127,null,6,3552,"Class_66",0,null,"n/a",null,null,"66/5Royal Mail",null,null,4.3274999999999997,6.7942999999999998]
[null,"66/5","N/A","Steel",null,null,127,null,6,3552,"Class_66",0,null,"n/a",null,null,"66/5Steel",null,null,2.6387999999999998,3.7964000000000002]
[null,"66/6","N/A","Biomass",null,null,127,null,6,3552,"Class_66",0,null,"n/a",null,null,"66/6Biomass",null,null,2.7686999999999999,4.2225000000000001]
[null,"66/6","N/A","Coal ESI",null,null,127,null,6,3552,"Class_66",0,null,"n/a",null,null,"66/6Coal ESI",null,null,2.5838000000000001,3.7517]
[null,"66/6","N/A","Coal Other",null,null,127,null,6,3552,"Class_66",0,null,"n/a",null,null,"66/6Coal Other",null,null,2.6387999999999998,3.7964000000000002]
[null,"66/6","N/A","Construction Materials",null,null,127,null,6,3552,"Class_66",0,null,"n/a",null,null,"66/6Construction Materials",null,null,2.6951000000000001,3.9807000000000001]
[null,"66/6","N/A","Domestic Intermodal",null,null,127,null,6,3552,"Class_66",0,null,"n/a",null,null,"66/6Domestic Intermodal",null,null,2.9855,4.1731999999999996]
[null,"66/6","N/A","Domestic Waste",null,null,127,null,6,3552,"Class_66",0,null,"n/a",null,null,"66/6Domestic Waste",null,null,2.8161,3.7517]
[null,"66/6","N/A","Industrial Minerals",null,null,127,null,6,3552,"Class_66",0,null,"n/a",null,null,"66/6Industrial Minerals",null,null,2.5463,3.4954999999999998]
[null,"66/6","N/A","Iron Ore",null,null,127,null,6,3552,"Class_66",0,null,"n/a",null,null,"66/6Iron Ore",null,null,2.5975999999999999,3.7964000000000002]
[null,"66/6","N/A","Other",null,null,127,null,6,3552,"Class_66",0,null,"n/a",null,null,"66/6Other",null,null,2.6387999999999998,3.7964000000000002]
[null,"66/6","N/A","Petroleum",null,null,127,null,6,3552,"Class_66",0,null,"n/a",null,null,"66/6Petroleum",null,null,2.6114999999999999,3.7075999999999998]
[null,"66/6","N/A","Steel",null,null,127,null,6,3552,"Class_66",0,null,"n/a",null,null,"66/6Steel",null,null,2.6387999999999998,3.7964000000000002]
[null,"66/7","N/A","Biomass",null,null,127,null,6,3552,"Class_66",0,null,"n/a",null,null,"66/7Biomass",null,null,2.7686999999999999,4.2225000000000001]
[null,"66/7","N/A","Chemicals",null,null,127,null,6,3552,"Class_66",0,null,"n/a",null,null,"66/7Chemicals",null,null,2.5213999999999999,3.4150999999999998]
[null,"66/7","N/A","Coal ESI",null,null,127,null,6,3552,"Class_66",0,null,"n/a",null,null,"66/7Coal ESI",null,null,2.5838000000000001,3.7517]
[null,"66/7","N/A","Coal Other",null,null,127,null,6,3552,"Class_66",0,null,"n/a",null,null,"66/7Coal Other",null,null,2.6387999999999998,3.7964000000000002]
[null,"66/7","N/A","Construction Materials",null,null,127,null,6,3552,"Class_66",0,null,"n/a",null,null,"66/7Construction Materials",null,null,2.6951000000000001,3.9807000000000001]
[null,"66/7","N/A","Domestic Automotive",null,null,127,null,6,3552,"Class_66",0,null,"n/a",null,null,"66/7Domestic Automotive",null,null,2.8706,3.7964000000000002]
[null,"66/7","N/A","Domestic Intermodal",null,null,127,null,6,3552,"Class_66",0,null,"n/a",null,null,"66/7Domestic Intermodal",null,null,2.9855,4.1731999999999996]
[null,"66/7","N/A","Domestic Waste",null,null,127,null,6,3552,"Class_66",0,null,"n/a",null,null,"66/7Domestic Waste",null,null,2.8161,3.7517]
[null,"66/7","N/A","European Automotive",null,null,127,null,6,3552,"Class_66",0,null,"n/a","Retain. Possible future use - as per GBRf spreadsheet",null,"66/7European Automotive",null,null,2.9559000000000002,4.0759999999999996]
[null,"66/7","N/A","European Conventional",null,null,127,null,6,3552,"Class_66",0,null,"n/a",null,null,"66/7European Conventional",null,null,2.9150999999999998,4.0759999999999996]
[null,"66/7","N/A","European Intermodal",null,null,127,null,6,3552,"Class_66",0,null,"n/a",null,null,"66/7European Intermodal",null,null,3.0617999999999999,4.4245000000000001]
[null,"66/7","N/A","Industrial Minerals",null,null,127,null,6,3552,"Class_66",0,null,"n/a",null,null,"66/7Industrial Minerals",null,null,2.5463,3.4954999999999998]
[null,"66/7","N/A","Iron Ore",null,null,127,null,6,3552,"Class_66",0,null,"n/a","Retain. Possible future use - as per GBRf spreadsheet",null,"66/7Iron Ore",null,null,2.5975999999999999,3.7964000000000002]
[null,"66/7","N/A","Mail and Premium Logistics",null,null,127,null,6,3552,"Class_66",0,null,"n/a","Retain. Possible future use - as per GBRf spreadsheet",null,"66/7Mail and Premium Logistics",null,null,4.3274999999999997,6.7942999999999998]
[null,"66/7","N/A","Other",null,null,127,null,6,3552,"Class_66",0,null,"n/a",null,null,"66/7Other",null,null,2.6387999999999998,3.7964000000000002]
[null,"66/7","N/A","Petroleum",null,null,127,null,6,3552,"Class_66",0,null,"n/a",null,null,"66/7Petroleum",null,null,2.6114999999999999,3.7075999999999998]
[null,"66/7","N/A","Royal Mail",null,null,127,null,6,3552,"Class_66",0,null,"n/a","Retain. Possible future use - as per GBRf spreadsheet",null,"66/7Royal Mail",null,null,4.3274999999999997,6.7942999999999998]
[null,"66/7","N/A","Steel",null,null,127,null,6,3552,"Class_66",0,null,"n/a",null,null,"66/7Steel",null,null,2.6387999999999998,3.7964000000000002]
[null,"66/8","N/A","Biomass",null,null,127,null,6,3552,"Class_66",0,null,"n/a",null,null,"66/8Biomass",null,null,2.7679,4.2225000000000001]
[null,"66/8","N/A","Coal ESI",null,null,127,null,6,3552,"Class_66",0,null,"n/a",null,null,"66/8Coal ESI",null,null,2.5838000000000001,3.7517]
[null,"66/8","N/A","Coal Other",null,null,127,null,6,3552,"Class_66",0,null,"n/a",null,null,"66/8Coal Other",null,null,2.6379000000000001,3.7964000000000002]
[null,"66/8","N/A","Construction Materials",null,null,127,null,6,3552,"Class_66",0,null,"n/a",null,null,"66/8Construction Materials",null,null,2.6941999999999999,3.9807000000000001]
[null,"66/8","N/A","Domestic Automotive",null,null,127,null,6,3552,"Class_66",0,null,"n/a",null,null,"66/8Domestic Automotive",null,null,2.8696000000000002,3.7964000000000002]
[null,"66/8","N/A","Domestic Intermodal",null,null,127,null,6,3552,"Class_66",0,null,"n/a",null,null,"66/8Domestic Intermodal",null,null,2.9845000000000002,4.1731999999999996]
[null,"66/8","N/A","Enterprise",null,null,127,null,6,3552,"Class_66",0,null,"n/a",null,null,"66/8Enterprise",null,null,2.8576000000000001,3.8875000000000002]
[null,"66/8","N/A","European Conventional",null,null,127,null,6,3552,"Class_66",0,null,"n/a",null,null,"66/8European Conventional",null,null,2.9150999999999998,4.0759999999999996]
[null,"66/8","N/A","European Intermodal",null,null,127,null,6,3552,"Class_66",0,null,"n/a",null,null,"66/8European Intermodal",null,null,3.0608,4.4245000000000001]
[null,"66/8","N/A","Industrial Minerals",null,null,127,null,6,3552,"Class_66",0,null,"n/a",null,null,"66/8Industrial Minerals",null,null,2.5453999999999999,3.4954999999999998]
[null,"66/8","N/A","Other",null,null,127,null,6,3552,"Class_66",0,null,"n/a",null,null,"66/8Other",null,null,2.6379000000000001,3.7964000000000002]
[null,"66/8","N/A","Petroleum",null,null,127,null,6,3552,"Class_66",0,null,"n/a",null,null,"66/8Petroleum",null,null,2.6107,3.7075999999999998]
[null,"66/8","N/A","Steel",null,null,127,null,6,3552,"Class_66",0,null,"n/a",null,null,"66/8Steel",null,null,2.6379000000000001,3.7964000000000002]
[null,"66/9","N/A","Coal ESI",null,null,127,null,6,3552,"Class_66",0,null,"n/a",null,null,"66/9Coal ESI",null,null,2.5838000000000001,3.7517]
[null,"66/9","N/A","Coal Other",null,null,127,null,6,3552,"Class_66",0,null,"n/a",null,null,"66/9Coal Other",null,null,2.6387999999999998,3.7964000000000002]
[null,"66/9","N/A","Construction Materials",null,null,127,null,6,3552,"Class_66",0,null,"n/a",null,null,"66/9Construction Materials",null,null,2.6951000000000001,3.9807000000000001]
[null,"66/9","N/A","Domestic Intermodal",null,null,127,null,6,3552,"Class_66",0,null,"n/a",null,null,"66/9Domestic Intermodal",null,null,2.9855,4.1731999999999996]
[null,"66/9","N/A","Domestic Waste",null,null,127,null,6,3552,"Class_66",0,null,"n/a",null,null,"66/9Domestic Waste",null,null,2.8161,3.7517]
[null,"66/9","N/A","Industrial Minerals",null,null,127,null,6,3552,"Class_66",0,null,"n/a",null,null,"66/9Industrial Minerals",null,null,2.5463,3.4954999999999998]
[null,"66/9","N/A","Iron Ore",null,null,127,null,6,3552,"Class_66",0,null,"n/a",null,null,"66/9Iron Ore",null,null,2.5975999999999999,3.7964000000000002]
[null,"66/9","N/A","Other",null,null,127,null,6,3552,"Class_66",0,null,"n/a",null,null,"66/9Other",null,null,2.6387999999999998,3.7964000000000002]
[null,"66/9","N/A","Petroleum",null,null,127,null,6,3552,"Class_66",0,null,"n/a",null,null,"66/9Petroleum",null,null,2.6114999999999999,3.7075999999999998]
[null,"66/9","N/A","Steel",null,null,127,null,6,3552,"Class_66",0,null,"n/a",null,null,"66/9Steel",null,null,2.6387999999999998,3.7964000000000002]
[null,"67/0","N/A","Biomass",null,null,90,null,4,2100,"Loco2_50",0,null,"n/a",null,null,"67/0Biomass",null,null,4.4802,7.1553000000000004]
[null,"67/0","N/A","Chemicals",null,null,90,null,4,2100,"Loco2_50",0,null,"n/a",null,null,"67/0Chemicals",null,null,4.2659000000000002,6.4287000000000001]
[null,"67/0","N/A","Coal ESI",null,null,90,null,4,2100,"Loco2_50",0,null,"n/a",null,null,"67/0Coal ESI",null,null,4.3108000000000004,6.7249999999999996]
[null,"67/0","N/A","Coal Other",null,null,90,null,4,2100,"Loco2_50",0,null,"n/a",null,null,"67/0Coal Other",null,null,4.3654999999999999,6.7652000000000001]
[null,"67/0","N/A","Construction Materials",null,null,90,null,4,2100,"Loco2_50",0,null,"n/a",null,null,"67/0Construction Materials",null,null,4.4146999999999998,6.9325000000000001]
[null,"67/0","N/A","Domestic Automotive",null,null,90,null,4,2100,"Loco2_50",0,null,"n/a",null,null,"67/0Domestic Automotive",null,null,4.6077000000000004,6.7652000000000001]
[null,"67/0","N/A","Domestic Intermodal",null,null,90,null,4,2100,"Loco2_50",0,null,"n/a",null,null,"67/0Domestic Intermodal",null,null,4.7089999999999996,7.1096000000000004]
[null,"67/0","N/A","Domestic Waste",null,null,90,null,4,2100,"Loco2_50",0,null,"n/a",null,null,"67/0Domestic Waste",null,null,4.5529999999999999,6.7249999999999996]
[null,"67/0","N/A","Enterprise",null,null,90,null,4,2100,"Loco2_50",0,null,"n/a",null,null,"67/0Enterprise",null,null,4.5891999999999999,6.8475999999999999]
[null,"67/0","N/A","European Automotive",null,null,90,null,4,2100,"Loco2_50",0,null,"n/a",null,null,"67/0European Automotive",null,null,4.6826999999999996,7.0198999999999998]
[null,"67/0","N/A","European Conventional",null,null,90,null,4,2100,"Loco2_50",0,null,"n/a",null,null,"67/0European Conventional",null,null,4.6398999999999999,7.0198999999999998]
[null,"67/0","N/A","European Intermodal",null,null,90,null,4,2100,"Loco2_50",0,null,"n/a",null,null,"67/0European Intermodal",null,null,4.7777000000000003,7.3438999999999997]
[null,"67/0","N/A","Industrial Minerals",null,null,90,null,4,2100,"Loco2_50",0,null,"n/a",null,null,"67/0Industrial Minerals",null,null,4.2865000000000002,6.4983000000000004]
[null,"67/0","N/A","Mail and Premium Logistics",null,null,90,null,4,2100,"Loco2_50",0,null,"n/a","Retain. Possible use, if GBRf are awarded contract.",null,"67/0Mail and Premium Logistics",null,null,6.0388000000000002,9.6499000000000006]
[null,"67/0","N/A","Other",null,null,90,null,4,2100,"Loco2_50",0,null,"n/a",null,null,"67/0Other",null,null,4.3654999999999999,6.7652000000000001]
[null,"67/0","N/A","Petroleum",null,null,90,null,4,2100,"Loco2_50",0,null,"n/a",null,null,"67/0Petroleum",null,null,4.3418999999999999,6.6853999999999996]
[null,"67/0","N/A","Royal Mail",null,null,90,null,4,2100,"Loco2_50",0,null,"n/a",null,null,"67/0Royal Mail",null,null,6.0388000000000002,9.6499000000000006]
[null,"67/0","N/A","Steel",null,null,90,null,4,2100,"Loco2_50",0,null,"n/a",null,null,"67/0Steel",null,null,4.3654999999999999,6.7652000000000001]
[null,"68/0","N/A","Chemicals",null,null,86,null,4,2664,"Class_68",0,null,"n/a",null,null,"68/0Chemicals",null,null,3.5831,5.0709]
[null,"68/0","N/A","Coal ESI",null,null,86,null,4,2664,"Class_68",0,null,"n/a",null,null,"68/0Coal ESI",null,null,3.6326999999999998,5.3699000000000003]
[null,"68/0","N/A","Coal other",null,null,86,null,4,2664,"Class_68",0,null,"n/a",null,null,"68/0Coal other",null,null,3.6855000000000002,5.41]
[null,"68/0","N/A","Construction Materials",null,null,86,null,4,2664,"Class_68",0,null,"n/a",null,null,"68/0Construction Materials",null,null,3.7353999999999998,5.5762999999999998]
[null,"68/0","N/A","Domestic Automotive",null,null,86,null,4,2664,"Class_68",0,null,"n/a",null,null,"68/0Domestic Automotive",null,null,3.9152,5.41]
[null,"68/0","N/A","Domestic Intermodal",null,null,86,null,4,2664,"Class_68",0,null,"n/a",null,null,"68/0Domestic Intermodal",null,null,4.0172999999999996,5.7511000000000001]
[null,"68/0","N/A","Industrial Minerals",null,null,86,null,4,2664,"Class_68",0,null,"n/a",null,null,"68/0Industrial Minerals",null,null,3.6046,5.1417000000000002]
[null,"68/0","N/A","Other",null,null,86,null,4,2664,"Class_68",0,null,"n/a",null,null,"68/0Other",null,null,3.6855000000000002,5.41]
[null,"68/0","N/A","Petroleum",null,null,86,null,4,2664,"Class_68",0,null,"n/a",null,null,"68/0Petroleum",null,null,3.6615000000000002,5.3303000000000003]
[null,"68/0","N/A","Steel",null,null,86,null,4,2664,"Class_68",0,null,"n/a",null,null,"68/0Steel",null,null,3.6855000000000002,5.41]
[null,"69/0 ","N/A","Biomass",null,null,128,null,6,4049.0000000000005,"Loco3_50",0,null,"n/a",null,null,"69/0 Biomass"]
[null,"69/0 ","N/A","Chemicals",null,null,128,null,6,4049.0000000000005,"Loco3_50",0,null,"n/a",null,null,"69/0 Chemicals"]
[null,"69/0 ","N/A","Coal ESI",null,null,128,null,6,4049.0000000000005,"Loco3_50",0,null,"n/a",null,null,"69/0 Coal ESI"]
[null,"69/0 ","N/A","Coal other",null,null,128,null,6,4049.0000000000005,"Loco3_50",0,null,"n/a",null,null,"69/0 Coal other"]
[null,"69/0 ","N/A","Construction Materials",null,null,128,null,6,4049.0000000000005,"Loco3_50",0,null,"n/a",null,null,"69/0 Construction Materials"]
[null,"69/0 ","N/A","Domestic Automotive",null,null,128,null,6,4049.0000000000005,"Loco3_50",0,null,"n/a",null,null,"69/0 Domestic Automotive"]
[null,"69/0 ","N/A","Domestic Intermodal",null,null,128,null,6,4049.0000000000005,"Loco3_50",0,null,"n/a",null,null,"69/0 Domestic Intermodal"]
[null,"69/0 ","N/A","Domestic Waste",null,null,128,null,6,4049.0000000000005,"Loco3_50",0,null,"n/a",null,null,"69/0 Domestic Waste"]
[null,"69/0 ","N/A","Enterprise",null,null,128,null,6,4049.0000000000005,"Loco3_50",0,null,"n/a",null,null,"69/0 Enterprise"]
[null,"69/0 ","N/A","European Automotive",null,null,128,null,6,4049.0000000000005,"Loco3_50",0,null,"n/a",null,null,"69/0 European Automotive"]
[null,"69/0 ","N/A","European Conventional",null,null,128,null,6,4049.0000000000005,"Loco3_50",0,null,"n/a",null,null,"69/0 European Conventional"]
[null,"69/0 ","N/A","European Intermodal",null,null,128,null,6,4049.0000000000005,"Loco3_50",0,null,"n/a",null,null,"69/0 European Intermodal"]
[null,"69/0 ","N/A","General Merchandise",null,null,128,null,6,4049.0000000000005,"Loco3_50",0,null,"n/a",null,null,"69/0 General Merchandise"]
[null,"69/0 ","N/A","Industrial Minerals",null,null,128,null,6,4049.0000000000005,"Loco3_50",0,null,"n/a",null,null,"69/0 Industrial Minerals"]
[null,"69/0 ","N/A","Iron Ore",null,null,128,null,6,4049.0000000000005,"Loco3_50",0,null,"n/a",null,null,"69/0 Iron Ore"]
[null,"69/0 ","N/A","Mail and Premium Logistics",null,null,128,null,6,4049.0000000000005,"Loco3_50",0,null,"n/a",null,null,"69/0 Mail and Premium Logistics"]
[null,"69/0 ","N/A","Other",null,null,128,null,6,4049.0000000000005,"Loco3_50",0,null,"n/a",null,null,"69/0 Other"]
[null,"69/0 ","N/A","Petroleum",null,null,128,null,6,4049.0000000000005,"Loco3_50",0,null,"n/a",null,null,"69/0 Petroleum"]
[null,"69/0 ","N/A","Royal Mail",null,null,128,null,6,4049.0000000000005,"Loco3_50",0,null,"n/a",null,null,"69/0 Royal Mail"]
[null,"69/0 ","N/A","Steel",null,null,128,null,6,4049.0000000000005,"Loco3_50",0,null,"n/a",null,null,"69/0 Steel"]
[null,"70/0","N/A","Biomass",null,null,123.5,null,6,4454,"Class_70",0,null,"n/a",null,null,"70/0Biomass",null,null,4.5887000000000002,6.8082000000000003]
[null,"70/0","N/A","Coal ESI",null,null,123.5,null,6,4454,"Class_70",0,null,"n/a",null,null,"70/0Coal ESI",null,null,4.3890000000000002,6.2961999999999998]
[null,"70/0","N/A","Coal other",null,null,123.5,null,6,4454,"Class_70",0,null,"n/a",null,null,"70/0Coal other",null,null,4.4451000000000001,6.3452000000000002]
[null,"70/0","N/A","Construction Materials",null,null,123.5,null,6,4454,"Class_70",0,null,"n/a",null,null,"70/0Construction Materials",null,null,4.5075000000000003,6.5462999999999996]
[null,"70/0","N/A","Domestic Automotive",null,null,123.5,null,6,4454,"Class_70",0,null,"n/a",null,null,"70/0Domestic Automotive",null,null,4.6733000000000002,6.3452000000000002]
[null,"70/0","N/A","Domestic Intermodal",null,null,123.5,null,6,4454,"Class_70",0,null,"n/a",null,null,"70/0Domestic Intermodal",null,null,4.8005000000000004,6.7549000000000001]
[null,"70/0","N/A","Domestic Waste",null,null,123.5,null,6,4454,"Class_70",0,null,"n/a",null,null,"70/0Domestic Waste",null,null,4.6180000000000003,6.2961999999999998]
[null,"70/0","N/A","Industrial Minerals",null,null,123.5,null,6,4454,"Class_70",0,null,"n/a",null,null,"70/0Industrial Minerals",null,null,4.3411999999999997,6.0132000000000003]
[null,"70/0","N/A","Other",null,null,123.5,null,6,4454,"Class_70",0,null,"n/a","Previously curving class was Loco_70, now changed to Class_70 which is identical. Loco_70 has been removed from HT damage sheet.16.03.23",null,"70/0Other"]
[null,"70/0","N/A","Petroleum",null,null,123.5,null,6,4454,"Class_70",0,null,"n/a",null,null,"70/0Petroleum",null,null,4.4146000000000001,6.2477]
[null,"70/0","N/A","Steel",null,null,123.5,null,6,4454,"Class_70",0,null,"n/a",null,null,"70/0Steel",null,null,4.4451000000000001,6.3452000000000002]
[null,"73/1","N/A","Construction Materials",null,null,75,null,4,3302,"Loco2_50",0,null,"n/a",null,null,"73/1Construction Materials",null,null,4.2047999999999996,6.2366999999999999]
[null,"73/1","N/A","Other",null,null,75,null,4,3302,"Loco2_50",0,null,"n/a",null,null,"73/1Other",null,null,4.1584000000000003,6.0833000000000004]
[null,"73/2","N/A","Construction Materials",null,null,75,null,4,3302,"Loco2_50",0,null,"n/a",null,null,"73/2Construction Materials",null,null,4.2047999999999996,6.2366999999999999]
[null,"73/2","N/A","Domestic Intermodal",null,null,75,null,4,3302,"Loco2_50",0,null,"n/a",null,null,"73/2Domestic Intermodal",null,null,4.4489000000000001,6.3956999999999997]
[null,"73/2","N/A","Other",null,null,75,null,4,3302,"Loco2_50",0,null,"n/a",null,null,"73/2Other",null,null,4.1603000000000003,6.0833000000000004]
[null,"86/1","N/A","Coal ESI",null,null,80,null,4,4200,"Loco2_50",0,null,"n/a",null,null,"86/1Coal ESI",null,null,4.2344999999999997,6.2390999999999996]
[null,"86/1","N/A","Domestic Intermodal",null,null,80,null,4,4200,"Loco2_50",0,null,"n/a",null,null,"86/1Domestic Intermodal",null,null,4.6243999999999996,6.6699000000000002]
[null,"86/1","N/A","Other",null,null,80,null,4,4200,"Loco2_50",0,null,"n/a",null,null,"86/1Other",null,null,4.2877999999999998,6.2851999999999997]
[null,"86/2","N/A","Other",null,null,80,null,4,4200,"Loco2_50",0,null,"n/a",null,null,"86/2Other",null,null,4.2877999999999998,6.2851999999999997]
[null,"86/6","N/A","Coal ESI",null,null,80,null,4,4200,"Loco2_50",0,null,"n/a",null,null,"86/6Coal ESI",null,null,4.2347000000000001,6.2390999999999996]
[null,"86/6","N/A","Construction Materials",null,null,80,null,4,4200,"Loco2_50",0,null,"n/a",null,null,"86/6Construction Materials",null,null,4.3467000000000002,6.4741]
[null,"86/6","N/A","Domestic Intermodal",null,null,80,null,4,4200,"Loco2_50",0,null,"n/a",null,null,"86/6Domestic Intermodal",null,null,4.6243999999999996,6.6699000000000002]
[null,"86/6","N/A","Other",null,null,80,null,4,4200,"Loco2_50",0,null,"n/a",null,null,"86/6Other",null,null,4.2877999999999998,6.2851999999999997]
[null,"88/0","N/A","Construction Materials",null,null,86,null,4,2664,"Cl_88/0",0,null,"n/a",null,null,"88/0Construction Materials",null,null,3.75,5.6228999999999996]
[null,"88/0","N/A","Domestic Intermodal",null,null,86,null,4,2664,"Cl_88/0",0,null,"n/a",null,null,"88/0Domestic Intermodal",null,null,4.0319000000000003,5.7976999999999999]
[null,"88/0","N/A","Other",null,null,86,null,4,2664,"Cl_88/0",0,null,"n/a",null,null,"88/0Other",null,null,3.7002000000000002,5.4565999999999999]
[null,"88/0 ","N/A","Domestic Automotive",null,null,86,null,4,2664,"Cl_88/0",0,null,"n/a","Previously curving class was Loco 88/0 - changed to Cl_88/0 which is identical and the reference to Loco 88/0 has been removed from the HT damage sheet. 16.03.23",null,"88/0 Domestic Automotive"]
[null,"90/0","N/A","Coal ESI",null,null,84,null,4,2700,"Loco2_50",0,null,"n/a",null,null,"90/0Coal ESI",null,null,4.2060000000000004,6.3731]
[null,"90/0","N/A","Construction Materials",null,null,84,null,4,2700,"Loco2_50",0,null,"n/a",null,null,"90/0Construction Materials",null,null,4.3055000000000003,6.5724999999999998]
[null,"90/0","N/A","Domestic Automotive",null,null,84,null,4,2700,"Loco2_50",0,null,"n/a",null,null,"90/0Domestic Automotive",null,null,4.4781000000000004,6.4119000000000002]
[null,"90/0","N/A","Domestic Intermodal",null,null,84,null,4,2700,"Loco2_50",0,null,"n/a",null,null,"90/0Domestic Intermodal",null,null,4.5770999999999997,6.7411000000000003]
[null,"90/0","N/A","Enterprise",null,null,84,null,4,2700,"Loco2_50",0,null,"n/a",null,null,"90/0Enterprise",null,null,4.4631999999999996,6.4912000000000001]
[null,"90/0","N/A","European Conventional",null,null,84,null,4,2700,"Loco2_50",0,null,"n/a",null,null,"90/0European Conventional",null,null,4.5126999999999997,6.6558000000000002]
[null,"90/0","N/A","Other",null,null,84,null,4,2700,"Loco2_50",0,null,"n/a",null,null,"90/0Other",null,null,4.2571000000000003,6.4119000000000002]
[null,"90/0","N/A","Royal Mail",null,null,84,null,4,2700,"Loco2_50",0,null,"n/a",null,null,"90/0Royal Mail",null,null,5.8018000000000001,9.0824999999999996]
[null,"90/0","N/A","Steel",null,null,84,null,4,2700,"Loco2_50",0,null,"n/a",null,null,"90/0Steel",null,null,4.2571000000000003,6.4119000000000002]
[null,"92/0","N/A","Biomass",null,null,126,null,6,3200,"Loco3_50",0,null,"n/a",null,null,"92/0Biomass",null,null,4.3349000000000002,6.6022999999999996]
[null,"92/0","N/A","Coal ESI",null,null,126,null,6,3200,"Loco3_50",0,null,"n/a",null,null,"92/0Coal ESI",null,null,4.16,6.1590999999999996]
[null,"92/0","N/A","Construction Materials",null,null,126,null,6,3200,"Loco3_50",0,null,"n/a",null,null,"92/0Construction Materials",null,null,4.2657999999999996,6.3745000000000003]
[null,"92/0","N/A","Domestic Automotive",null,null,126,null,6,3200,"Loco3_50",0,null,"n/a",null,null,"92/0Domestic Automotive",null,null,4.4387999999999996,6.2012]
[null,"92/0","N/A","Domestic Intermodal",null,null,126,null,6,3200,"Loco3_50",0,null,"n/a",null,null,"92/0Domestic Intermodal",null,null,4.5465,6.5557999999999996]
[null,"92/0","N/A","Enterprise",null,null,126,null,6,3200,"Loco3_50",0,null,"n/a",null,null,"92/0Enterprise",null,null,4.4252000000000002,6.2868000000000004]
[null,"92/0","N/A","European Automotive",null,null,126,null,6,3200,"Loco3_50",0,null,"n/a",null,null,"92/0European Automotive",null,null,4.5187999999999997,6.4641999999999999]
[null,"92/0","N/A","European Conventional",null,null,126,null,6,3200,"Loco3_50",0,null,"n/a",null,null,"92/0European Conventional",null,null,4.4791999999999996,6.4641999999999999]
[null,"92/0","N/A","European Intermodal",null,null,126,null,6,3200,"Loco3_50",0,null,"n/a",null,null,"92/0European Intermodal",null,null,4.6181999999999999,6.7929000000000004]
[null,"92/0","N/A","Industrial Minerals",null,null,126,null,6,3200,"Loco3_50",0,null,"n/a",null,null,"92/0Industrial Minerals",null,null,4.1265999999999998,5.9188999999999998]
[null,"92/0","N/A","Mail and Premium Logistics",null,null,126,null,6,3200,"Loco3_50",0,null,"n/a","Retain. Possible use, if GBRf are awarded contract.",null,"92/0Mail and Premium Logistics",null,null,5.8303000000000003,9.0408000000000008]
[null,"92/0","N/A","Other",null,null,126,null,6,3200,"Loco3_50",0,null,"n/a",null,null,"92/0Other",null,null,4.2130000000000001,6.2012]
[null,"92/0","N/A","Petroleum",null,null,126,null,6,3200,"Loco3_50",0,null,"n/a",null,null,"92/0Petroleum",null,null,4.1875,6.1177000000000001]
[null,"92/0","N/A","Royal Mail",null,null,126,null,6,3200,"Loco3_50",0,null,"n/a","Retain. Possible use, if GBRf are awarded contract.",null,"92/0Royal Mail",null,null,5.8303000000000003,9.0408000000000008]
[null,"97/3","N/A","Construction Materials",null,null,105,null,6,3238,"Loco3_50",0,null,"n/a",null,null,"97/3Construction Materials"]
[null,"97/3","N/A","Petroleum",null,null,105,null,6,3238,"Loco3_50",0,null,"n/a",null,null,"97/3Petroleum",null,null,4.0050999999999997,5.6437999999999997]
[null,1,"N/A","Other",null,null,42,null,4,1700,"Coach_8",6,null,"n/a",null,null,"1Other",null,null,1.228,1.3818999999999999]
[null,2,"N/A","Other",null,null,37.199999999999875,null,4,1260,"Coach_12_40",6,null,"n/a",null,null,"2Other",null,null,1.3974,1.6003000000000001]
[null,3,"N/A","Other",null,null,36.799999999999997,null,4,1260,"Coach_16_40",6,null,"n/a",null,null,"3Other",null,null,1.5406,1.7801]
[null,"BAAF (L)","Laden","Steel",null,null,80,null,4,1764,"Y25_loaded",5,null,"n/a",null,null,"BAAF (L)Steel"]
[null,"BAAF (T)","Unladen","Steel",null,null,24.5,null,4,1764,"Y25_empty",5,null,"n/a",null,null,"BAAF (T)Steel"]
[null,"BAAM (L)","Laden","Steel",null,null,74,null,4,1764,"Y25_loaded",5,null,"n/a",null,null,"BAAM (L)Steel",null,null,2.3593000000000002,2.7974999999999999]
[null,"BAAM (T)","Unladen","Steel",null,null,24.5,null,4,1764,"Y25_empty",5,null,"n/a",null,null,"BAAM (T)Steel"]
[null,"BAAT (L)","Laden","Industrial Minerals",null,null,83.5,null,4,2062,"NACO_loaded",4,null,"n/a",null,null,"BAAT (L)Industrial Minerals",null,null,2.8877999999999999,4.4359999999999999]
[null,"BAAT (L)","Laden","Steel",null,null,79.852074235807862,null,4,2062,"NACO_loaded",4,null,"n/a",null,null,"BAAT (L)Steel",null,null,2.8767,4.4257]
[null,"BAAT (T)","Unladen","Steel",null,null,23,null,4,2062,"NACO_empty",4,null,"n/a",null,null,"BAAT (T)Steel",null,null,1.2956000000000001,1.4863999999999999]
[null,"BAAU (T)","Unladen","Enterprise",null,null,25,null,4,1764,"Y25_empty",5,null,"n/a",null,null,"BAAU (T)Enterprise",null,null,1.1745000000000001,1.2159]
[null,"BAAU (L)","Laden","Industrial Minerals",null,null,85.722222222222229,null,4,1764,"Y25_loaded",5,null,"n/a",null,null,"BAAU (L)Industrial Minerals",null,null,2.2690999999999999,3.4224999999999999]
[null,"BAAU (T)","Unladen","Industrial Minerals",null,null,25,null,4,1764,"Y25_empty",5,null,"n/a",null,null,"BAAU (T)Industrial Minerals",null,null,1.0295000000000001,0.99939999999999996]
[null,"BAAU (L)","Laden","Steel",null,null,81.877056131019359,null,4,1764,"Y25_loaded",5,null,"n/a",null,null,"BAAU (L)Steel",null,null,2.2332999999999998,3.3374000000000001]
[null,"BAAU (T)","Unladen","Steel",null,null,24.826074232648015,null,4,1764,"Y25_empty",5,null,"n/a",null,null,"BAAU (T)Steel",null,null,1.0864,1.1671]
[null,"BAAV (T)","Unladen","Enterprise",null,null,25,null,4,1764,"Y25_empty",5,null,"n/a",null,null,"BAAV (T)Enterprise",null,null,1.175,1.2159]
[null,"BAAV (L)","Laden","Industrial Minerals",null,null,84.645161290322577,null,4,1764,"Y25_loaded",5,null,"n/a",null,null,"BAAV (L)Industrial Minerals",null,null,2.2360000000000002,3.3384999999999998]
[null,"BAAV (L)","Laden","Steel",null,null,82.145087447712527,null,4,1764,"Y25_loaded",5,null,"n/a",null,null,"BAAV (L)Steel",null,null,2.2349999999999999,3.3580000000000001]
[null,"BAAV (T)","Unladen","Steel",null,null,25,null,4,1764,"Y25_empty",5,null,"n/a",null,null,"BAAV (T)Steel",null,null,1.0867,1.1677]
[null,"BBAA (L)","Laden","Steel",null,null,86.456281514858929,null,4,1764,"Y25_loaded",5,null,"n/a",null,null,"BBAA (L)Steel",null,null,2.6501999999999999,3.7097000000000002]
[null,"BBAA (T)","Unladen","Steel",null,null,29,null,4,1764,"Y25_empty",5,null,"n/a",null,null,"BBAA (T)Steel",null,null,1.1178999999999999,1.1929000000000001]
[null,"BBAB (T)","Unladen","Enterprise",null,null,26,null,4,1764,"Y25_empty",5,null,"n/a",null,null,"BBAB (T)Enterprise",null,null,1.1791,1.2184999999999999]
[null,"BBAB (L)","Laden","Industrial Minerals",null,null,83.272182254196636,null,4,1764,"Y25_loaded",5,null,"n/a",null,null,"BBAB (L)Industrial Minerals",null,null,2.4823,3.2349000000000001]
[null,"BBAB (T)","Unladen","Industrial Minerals",null,null,26,null,4,1764,"Y25_empty",5,null,"n/a",null,null,"BBAB (T)Industrial Minerals",null,null,1.0353000000000001,1.0094000000000001]
[null,"BBAB (T)","Unladen","Other",null,null,26,null,4,1764,"Y25_empty",5,null,"n/a",null,null,"BBAB (T)Other",null,null,1.0913999999999999,1.1718999999999999]
[null,"BBAB (L)","Laden","Steel",null,null,83.966976113824742,null,4,1764,"Y25_loaded",5,null,"n/a",null,null,"BBAB (L)Steel",null,null,2.5649000000000002,3.5015999999999998]
[null,"BBAB (T)","Unladen","Steel",null,null,26,null,4,1764,"Y25_empty",5,null,"n/a",null,null,"BBAB (T)Steel",null,null,1.0903,1.1718999999999999]
[null,"BBAC (L)","Laden","Enterprise",null,null,51,null,4,1764,"Y25_loaded",5,null,"n/a",null,null,"BBAC (L)Enterprise",null,null,2.2157,1.8233999999999999]
[null,"BBAC (T)","Unladen","Enterprise",null,null,28.936738056013183,null,4,1764,"Y25_empty",5,null,"n/a",null,null,"BBAC (T)Enterprise",null,null,1.1980999999999999,1.2349000000000001]
[null,"BBAC (L)","Laden","Industrial Minerals",null,null,85.267944381811361,null,4,1764,"Y25_loaded",5,null,"n/a",null,null,"BBAC (L)Industrial Minerals",null,null,2.5484,3.3868]
[null,"BBAC (T)","Unladen","Industrial Minerals",null,null,28.796323314852643,null,4,1764,"Y25_empty",5,null,"n/a",null,null,"BBAC (T)Industrial Minerals",null,null,1.0548999999999999,1.0422]
[null,"BBAC (T)","Unladen","Other",null,null,29,null,4,1764,"Y25_empty",5,null,"n/a",null,null,"BBAC (T)Other",null,null,1.1056999999999999,1.1929000000000001]
[null,"BBAC (L)","Laden","Steel",null,null,86.545757613867409,null,4,1764,"Y25_loaded",5,null,"n/a",null,null,"BBAC (L)Steel",null,null,2.6537000000000002,3.7174]
[null,"BBAC (T)","Unladen","Steel",null,null,28.639719285646393,null,4,1764,"Y25_empty",5,null,"n/a",null,null,"BBAC (T)Steel",null,null,1.1046,1.1898]
[null,"BBAF (L)","Laden","Industrial Minerals",null,null,90.927953890489917,null,4,1764,"Y25_loaded",5,null,"n/a",null,null,"BBAF (L)Industrial Minerals",null,null,2.7079,3.8645999999999998]
[null,"BBAF (T)","Unladen","Industrial Minerals",null,null,27,null,4,1764,"Y25_empty",5,null,"n/a",null,null,"BBAF (T)Industrial Minerals",null,null,1.0465,1.0204]
[null,"BBAF (L)","Laden","Other",null,null,96.333333333333343,null,4,1764,"Y25_loaded",5,null,"n/a",null,null,"BBAF (L)Other",null,null,2.9603999999999999,4.6867999999999999]
[null,"BBAF (L)","Laden","Steel",null,null,86.541166087484143,null,4,1764,"Y25_loaded",5,null,"n/a",null,null,"BBAF (L)Steel",null,null,2.6551999999999998,3.7170000000000001]
[null,"BBAF (T)","Unladen","Steel",null,null,26.893975113012203,null,4,1764,"Y25_empty",5,null,"n/a",null,null,"BBAF (T)Steel",null,null,1.0993999999999999,1.1769000000000001]
[null,"BBAS (T)","Unladen","Enterprise",null,null,27,null,4,1764,"Y25_empty",5,null,"n/a",null,null,"BBAS (T)Enterprise",null,null,1.1902999999999999,1.2226999999999999]
[null,"BBAS (L)","Laden","Industrial Minerals",null,null,86.831460674157313,null,4,1764,"Y25_loaded",5,null,"n/a",null,null,"BBAS (L)Industrial Minerals",null,null,2.5912000000000002,3.5116000000000001]
[null,"BBAS (T)","Unladen","Industrial Minerals",null,null,27,null,4,1764,"Y25_empty",5,null,"n/a",null,null,"BBAS (T)Industrial Minerals",null,null,1.0501,1.0204]
[null,"BBAS (L)","Laden","Steel",null,null,85.461225580205294,null,4,1764,"Y25_loaded",5,null,"n/a",null,null,"BBAS (L)Steel",null,null,2.6233,3.6248]
[null,"BBAS (T)","Unladen","Steel",null,null,27,null,4,1764,"Y25_empty",5,null,"n/a",null,null,"BBAS (T)Steel",null,null,1.1026,1.1776]
[null,"BBAT (L)","Laden","Industrial Minerals",null,null,91.084870848708491,null,4,2062,"NACO_loaded",4,null,"n/a",null,null,"BBAT (L)Industrial Minerals",null,null,3.4055,4.9985999999999997]
[null,"BBAT (T)","Unladen","Industrial Minerals",null,null,26,null,4,2062,"NACO_empty",4,null,"n/a",null,null,"BBAT (T)Industrial Minerals",null,null,1.2221,1.2518]
[null,"BBAT (L)","Laden","Steel",null,null,84.836901329386862,null,4,2062,"NACO_loaded",4,null,"n/a",null,null,"BBAT (L)Steel",null,null,3.3384999999999998,4.7590000000000003]
[null,"BBAT (T)","Unladen","Steel",null,null,26,null,4,2062,"NACO_empty",4,null,"n/a",null,null,"BBAT (T)Steel",null,null,1.2935000000000001,1.4630000000000001]
[null,"BCAA (T)","Unladen","Enterprise",null,null,30,null,4,1764,"Y25_empty",5,null,"n/a",null,null,"BCAA (T)Enterprise",null,null,1.2098,1.2439]
[null,"BCAA (T)","Unladen","Other",null,null,30,null,4,1764,"Y25_empty",5,null,"n/a",null,null,"BCAA (T)Other",null,null,1.1194999999999999,1.2024999999999999]
[null,"BCAA (L)","Laden","Steel",null,null,90.213470120052619,null,4,1764,"Y25_loaded",5,null,"n/a",null,null,"BCAA (L)Steel",null,null,2.7597999999999998,4.0514000000000001]
[null,"BCAA (T)","Unladen","Steel",null,null,30,null,4,1764,"Y25_empty",5,null,"n/a",null,null,"BCAA (T)Steel",null,null,1.1173,1.2024999999999999]
[null,"BDAR (L)","Laden","Enterprise",null,null,65.678160919540218,null,4,1344,"Y25_loaded",5,null,"n/a",null,null,"BDAR (L)Enterprise",null,null,1.9434,2.3622000000000001]
[null,"BDAR (T)","Unladen","Enterprise",null,null,22.890518596123623,null,4,1344,"Y25_empty",5,null,"n/a",null,null,"BDAR (T)Enterprise",null,null,1.1123000000000001,1.1416999999999999]
[null,"BDAR (L)","Laden","Industrial Minerals",null,null,61.053844768593557,null,4,1344,"Y25_loaded",5,null,"n/a",null,null,"BDAR (L)Industrial Minerals",null,null,1.7186999999999999,2.0116000000000001]
[null,"BDAR (T)","Unladen","Industrial Minerals",null,null,22.975397580535546,null,4,1344,"Y25_empty",5,null,"n/a",null,null,"BDAR (T)Industrial Minerals",null,null,0.99629999999999996,0.9909]
[null,"BDAR (L)","Laden","Other",null,null,66.717579250720462,null,4,1344,"Y25_loaded",5,null,"n/a",null,null,"BDAR (L)Other",null,null,1.8414999999999999,2.3765999999999998]
[null,"BDAR (T)","Unladen","Other",null,null,22.790960451977401,null,4,1344,"Y25_empty",5,null,"n/a",null,null,"BDAR (T)Other",null,null,1.0353000000000001,1.1077999999999999]
[null,"BDAR (L)","Laden","Steel",null,null,56.587004175867136,null,4,1344,"Y25_loaded",5,null,"n/a",null,null,"BDAR (L)Steel",null,null,1.7099,1.9452]
[null,"BDAR (T)","Unladen","Steel",null,null,22.861323832595339,null,4,1344,"Y25_empty",5,null,"n/a",null,null,"BDAR (T)Steel",null,null,1.0349999999999999,1.1079000000000001]
[null,"BEAA (L)","Laden","Enterprise",null,null,68.799746514575403,null,4,1344,"Y25_loaded",5,null,"n/a",null,null,"BEAA (L)Enterprise",null,null,1.9944999999999999,2.5230000000000001]
[null,"BEAA (T)","Unladen","Enterprise",null,null,23,null,4,1344,"Y25_empty",5,null,"n/a",null,null,"BEAA (T)Enterprise",null,null,1.1106,1.1418999999999999]
[null,"BEAA (L)","Laden","Industrial Minerals",null,null,63.381502890173415,null,4,1344,"Y25_loaded",5,null,"n/a",null,null,"BEAA (L)Industrial Minerals",null,null,1.7531000000000001,2.1061999999999999]
[null,"BEAA (T)","Unladen","Industrial Minerals",null,null,22.990874448455674,null,4,1344,"Y25_empty",5,null,"n/a",null,null,"BEAA (T)Industrial Minerals",null,null,0.99419999999999997,0.99099999999999999]
[null,"BEAA (L)","Laden","Other",null,null,72.685106382978731,null,4,1344,"Y25_loaded",5,null,"n/a",null,null,"BEAA (L)Other",null,null,1.9457,2.7008999999999999]
[null,"BEAA (T)","Unladen","Other",null,null,23,null,4,1344,"Y25_empty",5,null,"n/a",null,null,"BEAA (T)Other",null,null,1.0338000000000001,1.1083000000000001]
[null,"BEAA (L)","Laden","Steel",null,null,58.53407351786359,null,4,1344,"Y25_loaded",5,null,"n/a",null,null,"BEAA (L)Steel",null,null,1.7343,2.0173999999999999]
[null,"BEAA (T)","Unladen","Steel",null,null,22.981043847995547,null,4,1344,"Y25_empty",5,null,"n/a",null,null,"BEAA (T)Steel",null,null,1.0339,1.1082000000000001]
[null,"BFAP (L)","Laden","Enterprise",null,null,57,null,4,1344,"Y25_loaded",5,null,"n/a",null,null,"BFAP (L)Enterprise",null,null,1.5539000000000001,1.9896]
[null,"BFAP (T)","Unladen","Enterprise",null,null,24,null,4,1344,"Y25_empty",5,null,"n/a",null,null,"BFAP (T)Enterprise",null,null,1.1156999999999999,1.1439999999999999]
[null,"BFAP (L)","Laden","Steel",null,null,53.440526446486217,null,4,1344,"Y25_loaded",5,null,"n/a",null,null,"BFAP (L)Steel",null,null,1.4371,1.8383]
[null,"BFAP (T)","Unladen","Steel",null,null,24,null,4,1344,"Y25_empty",5,null,"n/a",null,null,"BFAP (T)Steel",null,null,1.0379,1.1115999999999999]
[null,"BFAS (L)","Laden","Enterprise",null,null,55,null,4,1344,"Y25_loaded",5,null,"n/a",null,null,"BFAS (L)Enterprise",null,null,1.8121,1.9180999999999999]
[null,"BFAS (T)","Unladen","Industrial Minerals",null,null,23,null,4,1344,"Y25_empty",5,null,"n/a",null,null,"BFAS (T)Industrial Minerals",null,null,0.9889,0.99099999999999999]
[null,"BFAS (L)","Laden","Steel",null,null,49.559757689855168,null,4,1344,"Y25_loaded",5,null,"n/a",null,null,"BFAS (L)Steel",null,null,1.6328,1.7228000000000001]
[null,"BFAS (T)","Unladen","Steel",null,null,23,null,4,1344,"Y25_empty",5,null,"n/a",null,null,"BFAS (T)Steel",null,null,1.0285,1.1083000000000001]
[null,"BFAT (L)","Laden","Steel",null,null,50.031463256949941,null,4,1344,"Y25_loaded",5,null,"n/a",null,null,"BFAT (L)Steel",null,null,1.6316999999999999,1.7359]
[null,"BFAT (T)","Unladen","Steel",null,null,23,null,4,1344,"Y25_empty",5,null,"n/a",null,null,"BFAT (T)Steel",null,null,1.0369999999999999,1.1083000000000001]
[null,"BLAA (L)","Laden","Enterprise",null,null,95.63636363636364,null,4,1764,"Y25_loaded",5,null,"n/a",null,null,"BLAA (L)Enterprise",null,null,2.8767999999999998,4.6988000000000003]
[null,"BLAA (T)","Unladen","Enterprise",null,null,32,null,4,1764,"Y25_empty",5,null,"n/a",null,null,"BLAA (T)Enterprise",null,null,1.2364999999999999,1.2644]
[null,"BLAA (L)","Laden","Industrial Minerals",null,null,92.180947680157942,null,4,1764,"Y25_loaded",5,null,"n/a",null,null,"BLAA (L)Industrial Minerals",null,null,2.5225,3.9805000000000001]
[null,"BLAA (T)","Unladen","Industrial Minerals",null,null,32,null,4,1764,"Y25_empty",5,null,"n/a",null,null,"BLAA (T)Industrial Minerals",null,null,1.0949,1.0878000000000001]
[null,"BLAA (T)","Unladen","Other",null,null,32,null,4,1764,"Y25_empty",5,null,"n/a",null,null,"BLAA (T)Other",null,null,1.141,1.2250000000000001]
[null,"BLAA (L)","Laden","Steel",null,null,92.210509075569917,null,4,1764,"Y25_loaded",5,null,"n/a",null,null,"BLAA (L)Steel",null,null,2.6002999999999998,4.2474999999999996]
[null,"BLAA (T)","Unladen","Steel",null,null,32,null,4,1764,"Y25_empty",5,null,"n/a",null,null,"BLAA (T)Steel",null,null,1.1409,1.2250000000000001]
[null,"BLAP (T)","Unladen","Enterprise",null,null,33,null,4,1764,"Y25_empty",5,null,"n/a",null,null,"BLAP (T)Enterprise",null,null,1.2479,1.2765]
[null,"BLAP (L)","Laden","Steel",null,null,92.686876807333732,null,4,1764,"Y25_loaded",5,null,"n/a",null,null,"BLAP (L)Steel",null,null,2.8372999999999999,4.2957999999999998]
[null,"BLAP (T)","Unladen","Steel",null,null,33,null,4,1764,"Y25_empty",5,null,"n/a",null,null,"BLAP (T)Steel",null,null,1.1511,1.2379]
[null,"BMAA (L)","Laden","Steel",null,null,71.873605947955383,null,4,1344,"Y25_loaded",5,null,"n/a",null,null,"BMAA (L)Steel",null,null,1.9847999999999999,2.6534]
[null,"BMAA (T)","Unladen","Steel",null,null,24,null,4,1344,"Y25_empty",5,null,"n/a",null,null,"BMAA (T)Steel",null,null,1.0625,1.1115999999999999]
[null,"BMAB (L)","Laden","Steel",null,null,72.698805709292159,null,4,1344,"Y25_loaded",5,null,"n/a",null,null,"BMAB (L)Steel",null,null,2.0015999999999998,2.7017000000000002]
[null,"BMAB (T)","Unladen","Steel",null,null,24.557958477508652,null,4,1344,"Y25_empty",5,null,"n/a",null,null,"BMAB (T)Steel",null,null,1.0624,1.1141000000000001]
[null,"BNAA (L)","Laden","Steel",null,null,71.492792598967299,null,4,1530,"Y25_loaded",5,null,"n/a",null,null,"BNAA (L)Steel",null,null,1.9346000000000001,2.6394000000000002]
[null,"BNAA (T)","Unladen","Steel",null,null,24,null,4,1530,"Y25_empty",5,null,"n/a",null,null,"BNAA (T)Steel",null,null,1.0418000000000001,1.1352]
[null,"BPAR (L)","Laden","Steel",null,null,58.569025456992257,null,4,1530,"Y25_loaded",5,null,"n/a",null,null,"BPAR (L)Steel",null,null,1.7377,2.0285000000000002]
[null,"BPAR (T)","Unladen","Steel",null,null,22,null,4,1530,"Y25_empty",5,null,"n/a",null,null,"BPAR (T)Steel",null,null,1.0396000000000001,1.1323000000000001]
[null,"BQAA (L)","Laden","Steel",null,null,70.728906945681203,null,4,1344,"Y25_loaded",5,null,"n/a",null,null,"BQAA (L)Steel",null,null,1.9408000000000001,2.5882999999999998]
[null,"BQAA (T)","Unladen","Steel",null,null,26,null,4,1344,"Y25_empty",5,null,"n/a",null,null,"BQAA (T)Steel",null,null,1.0757000000000001,1.1226]
[null,"BRAB (T)","Unladen","Enterprise",null,null,28,null,4,2062,"NACO_empty",4,null,"n/a",null,null,"BRAB (T)Enterprise",null,null,1.4157,1.5155000000000001]
[null,"BRAB (T)","Unladen","Other",null,null,28,null,4,2062,"NACO_empty",4,null,"n/a",null,null,"BRAB (T)Other",null,null,1.3145,1.4589000000000001]
[null,"BTAA (L)","Laden","Enterprise",null,null,57.235425542969971,null,4,1344,"Y25_loaded",5,null,"n/a",null,null,"BTAA (L)Enterprise",null,null,1.8472999999999999,1.9984]
[null,"BTAA (T)","Unladen","Enterprise",null,null,22.95109515260323,null,4,1344,"Y25_empty",5,null,"n/a",null,null,"BTAA (T)Enterprise",null,null,1.1111,1.1417999999999999]
[null,"BTAA (T)","Unladen","Other",null,null,23,null,4,1344,"Y25_empty",5,null,"n/a",null,null,"BTAA (T)Other",null,null,1.0339,1.1083000000000001]
[null,"BTAA (L)","Laden","Steel",null,null,56.439579279516181,null,4,1344,"Y25_loaded",5,null,"n/a",null,null,"BTAA (L)Steel",null,null,1.7181999999999999,1.9399]
[null,"BTAA (T)","Unladen","Steel",null,null,22.935569709432958,null,4,1344,"Y25_empty",5,null,"n/a",null,null,"BTAA (T)Steel",null,null,1.0345,1.1081000000000001]
[null,"BTAR (L)","Laden","Steel",null,null,55.735404896421841,null,4,1344,"Y25_loaded",5,null,"n/a",null,null,"BTAR (L)Steel",null,null,1.7150000000000001,1.9151]
[null,"BTAR (T)","Unladen","Steel",null,null,22,null,4,1344,"Y25_empty",5,null,"n/a",null,null,"BTAR (T)Steel",null,null,1.0302,1.1065]
[null,"BVAA (L)","Laden","Steel",null,null,60.643748982531484,null,4,1632,"NACO_loaded",4,null,"n/a",null,null,"BVAA (L)Steel",null,null,2.5779999999999998,3.6558999999999999]
[null,"BVAA (T)","Unladen","Steel",null,null,19,null,4,1632,"NACO_empty",4,null,"n/a",null,null,"BVAA (T)Steel",null,null,1.3148,1.4890000000000001]
[null,"BXAA (L)","Laden","Steel",null,null,100,null,4,1764,"Y25_loaded",5,null,"n/a",null,null,"BXAA (L)Steel",null,null,3.1086999999999998,5.1196999999999999]
[null,"BXAA (T)","Unladen","Steel",null,null,36,null,4,1764,"Y25_empty",5,null,"n/a",null,null,"BXAA (T)Steel",null,null,1.1863999999999999,1.2828999999999999]
[null,"BYAA (T)","Unladen","Enterprise",null,null,28,null,4,2062,"NACO_empty",4,null,"n/a",null,null,"BYAA (T)Enterprise",null,null,1.4157,1.5155000000000001]
[null,"BYAA (L)","Laden","Industrial Minerals",null,null,87.670023891501671,null,4,2062,"NACO_loaded",4,null,"n/a",null,null,"BYAA (L)Industrial Minerals",null,null,3.3321999999999998,4.7270000000000003]
[null,"BYAA (T)","Unladen","Industrial Minerals",null,null,28,null,4,2062,"NACO_empty",4,null,"n/a",null,null,"BYAA (T)Industrial Minerals",null,null,1.2477,1.2611000000000001]
[null,"BYAA (L)","Laden","Other",null,null,82,null,4,2062,"NACO_loaded",4,null,"n/a",null,null,"BYAA (L)Other",null,null,3.2715999999999998,4.5617000000000001]
[null,"BYAA (T)","Unladen","Other",null,null,28,null,4,2062,"NACO_empty",4,null,"n/a",null,null,"BYAA (T)Other",null,null,1.3145,1.4589000000000001]
[null,"BYAA (L)","Laden","Steel",null,null,91.909399117166501,null,4,2062,"NACO_loaded",4,null,"n/a",null,null,"BYAA (L)Steel",null,null,3.5249999999999999,5.3449999999999998]
[null,"BYAA (T)","Unladen","Steel",null,null,28.019226443131373,null,4,2062,"NACO_empty",4,null,"n/a",null,null,"BYAA (T)Steel",null,null,1.3145,1.4589000000000001]
[null,"BYAB (T)","Unladen","Enterprise",null,null,26,null,4,2062,"NACO_empty",4,null,"n/a",null,null,"BYAB (T)Enterprise",null,null,1.4133,1.5235000000000001]
[null,"BYAB (L)","Laden","Industrial Minerals",null,null,89.747864213113672,null,4,2062,"NACO_loaded",4,null,"n/a",null,null,"BYAB (L)Industrial Minerals",null,null,3.3910999999999998,4.8884999999999996]
[null,"BYAB (T)","Unladen","Industrial Minerals",null,null,26,null,4,2062,"NACO_empty",4,null,"n/a",null,null,"BYAB (T)Industrial Minerals",null,null,1.2421,1.2518]
[null,"BYAB (T)","Unladen","Other",null,null,26,null,4,2062,"NACO_empty",4,null,"n/a",null,null,"BYAB (T)Other",null,null,1.3137000000000001,1.4630000000000001]
[null,"BYAB (L)","Laden","Steel",null,null,94.258032383689866,null,4,2062,"NACO_loaded",4,null,"n/a",null,null,"BYAB (L)Steel",null,null,3.6156000000000001,5.5716999999999999]
[null,"BYAB (T)","Unladen","Steel",null,null,26,null,4,2062,"NACO_empty",4,null,"n/a",null,null,"BYAB (T)Steel",null,null,1.3137000000000001,1.4630000000000001]
[null,"BYAO (T)","Unladen","Enterprise",null,null,26.25,null,4,2062,"NACO_empty",4,null,"n/a",null,null,"BYAO (T)Enterprise"]
[null,"BYAO (L)","Laden","Steel",null,null,91.91,null,4,2062,"NACO_loaded",4,null,"n/a",null,null,"BYAO (L)Steel"]
[null,"BYAO (T)","Unladen","Steel",null,null,26.25,null,4,2062,"NACO_empty",4,null,"n/a",null,null,"BYAO (T)Steel"]
[null,"BZAA (L)","Laden","Enterprise",null,null,92.571428571428584,null,4,1764,"Y25_loaded",5,null,"n/a",null,null,"BZAA (L)Enterprise",null,null,2.5678000000000001,4.3669000000000002]
[null,"BZAA (L)","Laden","Industrial Minerals",null,null,84.000145137880992,null,4,1764,"Y25_loaded",5,null,"n/a",null,null,"BZAA (L)Industrial Minerals",null,null,2.1114000000000002,3.2894000000000001]
[null,"BZAA (T)","Unladen","Industrial Minerals",null,null,31,null,4,1764,"Y25_empty",5,null,"n/a",null,null,"BZAA (T)Industrial Minerals",null,null,1.0840000000000001,1.0727]
[null,"BZAA (T)","Unladen","Other",null,null,31,null,4,1764,"Y25_empty",5,null,"n/a",null,null,"BZAA (T)Other",null,null,1.1314,1.2132000000000001]
[null,"BZAA (L)","Laden","Steel",null,null,91.666990862889534,null,4,1764,"Y25_loaded",5,null,"n/a",null,null,"BZAA (L)Steel",null,null,2.3982999999999999,4.1931000000000003]
[null,"BZAA (T)","Unladen","Steel",null,null,31,null,4,1764,"Y25_empty",5,null,"n/a",null,null,"BZAA (T)Steel",null,null,1.1313,1.2132000000000001]
[null,"CDAR (L)","Laden","Industrial Minerals",null,null,47,null,2,1646,"2axle_loaded",2,null,"n/a",null,null,"CDAR (L)Industrial Minerals",null,null,3.121,4.9321000000000002]
[null,"CDAR (T)","Unladen","Industrial Minerals",null,null,15,null,2,1646,"2axle_empty",2,null,"n/a",null,null,"CDAR (T)Industrial Minerals",null,null,1.2656000000000001,1.3662000000000001]
[null,"DCAY (T)","Unladen","Other",null,null,49,null,4,1485,"Y25_empty",5,null,"n/a",null,null,"DCAY (T)Other"]
[null,"DCEY (T)","Unladen","Other",null,null,52,null,4,1470,"Y25_empty",6,null,"n/a",null,null,"DCEY (T)Other",null,null,1.3478000000000001,1.5982000000000001]
[null,"DDAY (T)","Unladen","Other",null,null,53,null,4,1605,"Y25_empty",5,null,"n/a",null,null,"DDAY (T)Other"]
[null,"DHAY (T)","Unladen","Other",null,null,38,null,4,1405,"Y25_empty",5,null,"n/a",null,null,"DHAY (T)Other"]
[null,"DHEY (T)","Unladen","Other",null,null,35,null,4,1470,"Y25_empty",6,null,"n/a",null,null,"DHEY (T)Other",null,null,1.1040000000000001,1.2012]
[null,"DPEX (T)","Unladen","Other",null,null,25,null,2,1400,"2axle_empty",2,null,"n/a",null,null,"DPEX (T)Other",null,null,1.5634999999999999,1.9001999999999999]
[null,"DPEY (T)","Unladen","Other",null,null,55,null,4,1975,"Y25_empty",6,null,"n/a",null,null,"DPEY (T)Other",null,null,1.4576,1.7248000000000001]
[null,"DREY (T)","Unladen","Other",null,null,53,null,4,1975,"Y25_empty",6,null,"n/a",null,null,"DREY (T)Other",null,null,1.4159999999999999,1.6581999999999999]
[null,"DXEY (T)","Unladen","Other",null,null,43,null,4,1300,"Y25_empty",5,null,"n/a",null,null,"DXEY (T)Other",null,null,1.2251000000000001,1.3897999999999999]
[null,"EAEY (T)","Unladen","Other",null,null,44.977255144669662,null,4,1470,"Y25_empty",6,null,"n/a",null,null,"EAEY (T)Other",null,null,1.2572000000000001,1.4008]
[null,"ECAY (T)","Unladen","Other",null,null,61,null,4,1470,"Y25_empty",6,null,"n/a",null,null,"ECAY (T)Other",null,null,1.5503,1.9278999999999999]
[null,"ECAY (L)","Laden","Royal Mail",null,null,61,null,4,2940,"Coach_35_50","n/a",null,0.89,"Nick Prag 14.11.23 email",null,"ECAY (L)Royal Mail",null,null,2.3555999999999999,3.1650999999999998]
[null,"ECAY (T)","Unladen","Royal Mail",null,null,55.25,null,4,2940,"Coach_35_50","n/a",null,0.89,"Nick Prag 14.11.23 email",null,"ECAY (T)Royal Mail",null,null,2.0373999999999999,2.4176000000000002]
[null,"ECEY (T)","Unladen","Other",null,null,37.806869786144397,null,4,1470,"Y25_empty",6,null,"n/a",null,null,"ECEY (T)Other",null,null,1.1032999999999999,1.248]
[null,"ECEY (T)","Unladen","Royal Mail",null,null,37,null,4,1470,"Y25_empty",6,null,"n/a",null,null,"ECEY (T)Royal Mail",null,null,1.6031,2.0009999999999999]
[null,"EDEY (T)","Unladen","Other",null,null,50.090909090909086,null,4,1470,"Y25_empty",5,null,"n/a",null,null,"EDEY (T)Other",null,null,1.3491,1.5958000000000001]
[null,"EEAY (T)","Unladen","Other",null,null,40,null,4,1310,"Y25_empty",6,null,"n/a",null,null,"EEAY (T)Other",null,null,1.1826000000000001,1.2779]
[null,"EEAY (L)","Laden","Royal Mail",null,null,40,null,4,1310,"Coach_17_30","n/a",null,0.89,"Nick Prag 14.11.23 email",null,"EEAY (L)Royal Mail",null,null,1.7467999999999999,2.1295000000000002]
[null,"EEAY (T)","Unladen","Royal Mail",null,null,34.6,null,4,1310,"Coach_17_30","n/a",null,0.89,"Nick Prag 14.11.23 email",null,"EEAY (T)Royal Mail",null,null,1.5649,1.8148]
[null,"EEEY (T)","Unladen","Other",null,null,36.641918066200219,null,4,1310,"Y25_empty",5,null,"n/a",null,null,"EEEY (T)Other",null,null,1.1551,1.2559]
[null,"EEEY (T)","Unladen","Royal Mail",null,null,36,null,4,1310,"Y25_empty",5,null,"n/a",null,null,"EEEY (T)Royal Mail",null,null,1.5834999999999999,1.9241999999999999]
[null,"EHAY (T)","Unladen","Other",null,null,42,null,4,1310,"Y25_empty",6,null,"n/a",null,null,"EHAY (T)Other",null,null,1.2059,1.3204]
[null,"EHAY (L)","Laden","Royal Mail",null,null,42,null,4,1310,"Coach_17_30","n/a",null,0.89,"Nick Prag 14.11.23 email",null,"EHAY (L)Royal Mail",null,null,1.7806999999999999,2.1749000000000001]
[null,"EHAY (T)","Unladen","Royal Mail",null,null,36.450000000000003,null,4,1310,"Coach_17_30","n/a",null,0.89,"Nick Prag 14.11.23 email",null,"EHAY (T)Royal Mail",null,null,1.5863,1.8176000000000001]
[null,"EHEY (T)","Unladen","Other",null,null,35.691083632915891,null,4,1310,"Y25_empty",6,null,"n/a",null,null,"EHEY (T)Other",null,null,1.1111,1.1989000000000001]
[null,"EHEY (T)","Unladen","Royal Mail",null,null,35,null,4,1310,"Y25_empty",6,null,"n/a",null,null,"EHEY (T)Royal Mail",null,null,1.5190999999999999,1.8471]
[null,"EIEY (T)","Unladen","Other",null,null,37.97865168539326,null,4,1310,"Y25_empty",6,null,"n/a",null,null,"EIEY (T)Other",null,null,1.1207,1.2387999999999999]
[null,"EJEY (T)","Unladen","Other",null,null,30.497975708502025,null,4,1310,"Y25_empty",6,null,"n/a",null,null,"EJEY (T)Other",null,null,1.0518000000000001,1.1268]
[null,"EKEY (T)","Unladen","Other",null,null,30.909977654027596,null,4,1764,"Y25_empty",6,null,"n/a",null,null,"EKEY (T)Other",null,null,1.1626000000000001,1.1744000000000001]
[null,"ELEY (T)","Unladen","Other",null,null,45.605178341211861,null,4,1764,"Y25_empty",6,null,"n/a",null,null,"ELEY (T)Other",null,null,1.2713000000000001,1.4353]
[null,"EMEY (T)","Unladen","Other",null,null,43,null,4,1764,"Y25_empty",6,null,"n/a",null,null,"EMEY (T)Other",null,null,1.2325999999999999,1.3737999999999999]
[null,"EZAY (T)","Unladen","Other",null,null,39,null,4,1764,"Y25_empty",6,null,"n/a",null,null,"EZAY (T)Other",null,null,1.1856,1.2921]
[null,"FAAA (L)","Laden","Enterprise",null,null,44.228855721393039,null,4,1292,"Y25_loaded",5,null,"n/a",null,null,"FAAA (L)Enterprise",null,null,1.6180000000000001,1.6122000000000001]
[null,"FAAA (T)","Unladen","Enterprise",null,null,34,null,4,1292,"Y25_empty",5,null,"n/a",null,null,"FAAA (T)Enterprise",null,null,1.2063999999999999,1.2335]
[null,"FAAA (L)","Laden","Other",null,null,46.497634643377005,null,4,1292,"Y25_loaded",5,null,"n/a",null,null,"FAAA (L)Other",null,null,1.5277000000000001,1.6406000000000001]
[null,"FAAA (T)","Unladen","Other",null,null,34,null,4,1292,"Y25_empty",5,null,"n/a",null,null,"FAAA (T)Other",null,null,1.1169,1.2095]
[null,"FAAU (T)","Unladen","Domestic Automotive",null,null,34,null,4,1292,"Y25_empty",5,null,"n/a",null,null,"FAAU (T)Domestic Automotive",null,null,1.2049000000000001,1.2095]
[null,"FAAU (L)","Laden","Domestic Intermodal",null,null,47.862626957624038,null,4,1292,"Y25_loaded",5,null,"n/a",null,null,"FAAU (L)Domestic Intermodal",null,null,1.7534000000000001,1.7737000000000001]
[null,"FAAU (T)","Unladen","Domestic Intermodal",null,null,33.83043122716041,null,4,1292,"Y25_empty",5,null,"n/a",null,null,"FAAU (T)Domestic Intermodal",null,null,1.2362,1.3036000000000001]
[null,"FAAU (L)","Laden","Enterprise",null,null,49.078843226788436,null,4,1292,"Y25_loaded",5,null,"n/a",null,null,"FAAU (L)Enterprise",null,null,1.6351,1.7311000000000001]
[null,"FAAU (T)","Unladen","Enterprise",null,null,33.848006265091691,null,4,1292,"Y25_empty",5,null,"n/a",null,null,"FAAU (T)Enterprise",null,null,1.2399,1.2311000000000001]
[null,"FAAU (L)","Laden","Other",null,null,46.29144925992972,null,4,1292,"Y25_loaded",5,null,"n/a",null,null,"FAAU (L)Other",null,null,1.5145,1.6355999999999999]
[null,"FAAU (T)","Unladen","Other",null,null,33.843676000751742,null,4,1292,"Y25_empty",5,null,"n/a",null,null,"FAAU (T)Other",null,null,1.1466000000000001,1.2071000000000001]
[null,"FBAK (L)","Laden","Domestic Intermodal",null,null,34.79,null,4,1292,"Y25_Loaded",5,null,"n/a",null,null,"FBAK (L)Domestic Intermodal",null,null,1.3391,1.5331999999999999]
[null,"FBAK (T)","Unladen","Domestic Intermodal",null,null,20,null,4,1292,"Y25_Empty",5,null,"n/a",null,null,"FBAK (T)Domestic Intermodal",null,null,1.1112,1.2427999999999999]
[null,"FCAA (L)","Laden","Coal Other",null,null,72.2638049769741,null,4,1820,"NACO_loaded",4,null,"n/a",null,null,"FCAA (L)Coal Other",null,null,2.7305999999999999,4.0221999999999998]
[null,"FCAA (T)","Unladen","Coal Other",null,null,25,null,4,1820,"NACO_empty",4,null,"n/a",null,null,"FCAA (T)Coal Other",null,null,1.2895000000000001,1.4375]
[null,"FCAA (L)","Laden","Construction Materials",null,null,57.793179601904434,null,4,1820,"NACO_loaded",4,null,"n/a",null,null,"FCAA (L)Construction Materials",null,null,2.5960999999999999,3.7021999999999999]
[null,"FCAA (T)","Unladen","Construction Materials",null,null,25,null,4,1820,"NACO_empty",4,null,"n/a",null,null,"FCAA (T)Construction Materials",null,null,1.325,1.5427]
[null,"FCAA (L)","Laden","Domestic Automotive",null,null,85.5,null,4,1820,"NACO_loaded",4,null,"n/a",null,null,"FCAA (L)Domestic Automotive",null,null,3.0916000000000001,4.7991000000000001]
[null,"FCAA (T)","Unladen","Domestic Automotive",null,null,25,null,4,1820,"NACO_empty",4,null,"n/a",null,null,"FCAA (T)Domestic Automotive",null,null,1.3405,1.4375]
[null,"FCAA (L)","Laden","Domestic Intermodal",null,null,48.172458799849039,null,4,1820,"NACO_loaded",4,null,"n/a",null,null,"FCAA (L)Domestic Intermodal",null,null,2.8193000000000001,3.7675999999999998]
[null,"FCAA (T)","Unladen","Domestic Intermodal",null,null,25,null,4,1820,"NACO_empty",4,null,"n/a",null,null,"FCAA (T)Domestic Intermodal",null,null,1.4117,1.6479999999999999]
[null,"FCAA (L)","Laden","Domestic Waste",null,null,53.300420687626413,null,4,1820,"NACO_loaded",4,null,"n/a",null,null,"FCAA (L)Domestic Waste",null,null,2.6181000000000001,3.5748000000000002]
[null,"FCAA (T)","Unladen","Domestic Waste",null,null,25,null,4,1820,"NACO_empty",4,null,"n/a",null,null,"FCAA (T)Domestic Waste",null,null,1.3563000000000001,1.4113]
[null,"FCAA (L)","Laden","Enterprise",null,null,59.526565381882833,null,4,1820,"NACO_loaded",4,null,"n/a",null,null,"FCAA (L)Enterprise",null,null,2.6349999999999998,3.6871]
[null,"FCAA (T)","Unladen","Enterprise",null,null,25,null,4,1820,"NACO_empty",4,null,"n/a",null,null,"FCAA (T)Enterprise",null,null,1.383,1.4901]
[null,"FCAA (L)","Laden","European Conventional",null,null,62.5,null,4,1820,"NACO_loaded",4,null,"n/a",null,null,"FCAA (L)European Conventional",null,null,2.6213000000000002,3.8319000000000001]
[null,"FCAA (T)","Unladen","European Conventional",null,null,25,null,4,1820,"NACO_empty",4,null,"n/a",null,null,"FCAA (T)European Conventional",null,null,1.4185000000000001,1.5952999999999999]
[null,"FCAA (L)","Laden","European Intermodal",null,null,77,null,4,1820,"NACO_loaded",4,null,"n/a",null,null,"FCAA (L)European Intermodal",null,null,3.0764,4.6501000000000001]
[null,"FCAA (T)","Unladen","European Intermodal",null,null,25,null,4,1820,"NACO_empty",4,null,"n/a",null,null,"FCAA (T)European Intermodal",null,null,1.4562999999999999,1.7799]
[null,"FCAA (L)","Laden","Industrial Minerals",null,null,60.165502952282537,null,4,1820,"NACO_loaded",4,null,"n/a",null,null,"FCAA (L)Industrial Minerals",null,null,2.4916999999999998,3.5219]
[null,"FCAA (T)","Unladen","Industrial Minerals",null,null,25,null,4,1820,"NACO_empty",4,null,"n/a",null,null,"FCAA (T)Industrial Minerals",null,null,1.2274,1.2541]
[null,"FCAA (L)","Laden","Other",null,null,51.605466578424888,null,4,1820,"NACO_loaded",4,null,"n/a",null,null,"FCAA (L)Other",null,null,2.7126000000000001,3.5945]
[null,"FCAA (T)","Unladen","Other",null,null,25,null,4,1820,"NACO_empty",4,null,"n/a",null,null,"FCAA (T)Other",null,null,1.2895000000000001,1.4375]
[null,"FCAA (L)","Laden","Steel",null,null,57.437663537573776,null,4,1820,"NACO_loaded",4,null,"n/a",null,null,"FCAA (L)Steel",null,null,2.5423,3.6190000000000002]
[null,"FCAA (T)","Unladen","Steel",null,null,25,null,4,1820,"NACO_empty",4,null,"n/a",null,null,"FCAA (T)Steel",null,null,1.2896000000000001,1.4375]
[null,"FDAA (T)","Unladen","Other",null,null,22,null,4,1820,"3piece_empty",3,null,"n/a",null,null,"FDAA (T)Other",null,null,1.3807,1.5710999999999999]
[null,"FEAA (L)","Laden","Construction Materials",null,null,56.077965746608704,null,4,1450,"Y25_loaded",5,null,"n/a",null,null,"FEAA (L)Construction Materials",null,null,1.4346000000000001,1.9951000000000001]
[null,"FEAA (T)","Unladen","Construction Materials",null,null,20.943417710431813,null,4,1450,"Y25_empty",5,null,"n/a",null,null,"FEAA (T)Construction Materials",null,null,1.0579000000000001,1.2053]
[null,"FEAA (L)","Laden","Domestic Intermodal",null,null,54.748663857210069,null,4,1450,"Y25_loaded",5,null,"n/a",null,null,"FEAA (L)Domestic Intermodal",null,null,1.5845,2.0110999999999999]
[null,"FEAA (T)","Unladen","Domestic Intermodal",null,null,20.998471964313858,null,4,1450,"Y25_empty",5,null,"n/a",null,null,"FEAA (T)Domestic Intermodal",null,null,1.1275999999999999,1.2882]
[null,"FEAB (L)","Laden","Construction Materials",null,null,55.522879757615065,null,4,1250,"Y25_loaded",5,null,"n/a",null,null,"FEAB (L)Construction Materials",null,null,1.3784000000000001,1.9570000000000001]
[null,"FEAB (T)","Unladen","Construction Materials",null,null,20.132592104942336,null,4,1250,"Y25_empty",5,null,"n/a",null,null,"FEAB (T)Construction Materials",null,null,1.0522,1.1603000000000001]
[null,"FEAB (L)","Laden","Domestic Intermodal",null,null,50.229381661714939,null,4,1250,"Y25_loaded",5,null,"n/a",null,null,"FEAB (L)Domestic Intermodal",null,null,1.4835,1.8352999999999999]
[null,"FEAB (T)","Unladen","Domestic Intermodal",null,null,20,null,4,1250,"Y25_empty",5,null,"n/a",null,null,"FEAB (T)Domestic Intermodal",null,null,1.1169,1.2279]
[null,"FEAB (L)","Laden","Domestic Waste",null,null,52.41,null,4,1250,"Y25_Loaded",5,null,"n/a",null,null,"FEAB (L)Domestic Waste",null,null,1.4581999999999999,1.7881]
[null,"FEAB (T)","Unladen","Domestic Waste",null,null,20,null,4,1250,"Y25_empty",5,null,"n/a",null,null,"FEAB (T)Domestic Waste",null,null,1.0861000000000001,1.0775999999999999]
[null,"FEAB (T)","Unladen","Industrial Minerals",null,null,20,null,4,1250,"Y25_empty",5,null,"n/a",null,null,"FEAB (T)Industrial Minerals",null,null,0.99039999999999995,0.97760000000000002]
[null,"FEAB (T)","Unladen","Other",null,null,20,null,4,1250,"Y25_empty",5,null,"n/a",null,null,"FEAB (T)Other",null,null,1.0299,1.0942000000000001]
[null,"FEAC (L)","Laden","Construction Materials",null,null,56.168003674131064,null,4,1450,"Y25_loaded",5,null,"n/a",null,null,"FEAC (L)Construction Materials",null,null,1.4351,1.9984]
[null,"FEAC (T)","Unladen","Construction Materials",null,null,21,null,4,1450,"Y25_empty",5,null,"n/a",null,null,"FEAC (T)Construction Materials",null,null,1.0667,1.2050000000000001]
[null,"FEAC (L)","Laden","Domestic Intermodal",null,null,54.350879509230111,null,4,1450,"Y25_loaded",5,null,"n/a",null,null,"FEAC (L)Domestic Intermodal",null,null,1.5829,1.9970000000000001]
[null,"FEAC (T)","Unladen","Domestic Intermodal",null,null,21,null,4,1450,"Y25_empty",5,null,"n/a",null,null,"FEAC (T)Domestic Intermodal",null,null,1.1373,1.2882]
[null,"FEAE (L)","Laden","Construction Materials",null,null,52.21408378308918,null,4,1450,"Y25_loaded",5,null,"n/a",null,null,"FEAE (L)Construction Materials",null,null,1.3852,1.8645]
[null,"FEAE (T)","Unladen","Construction Materials",null,null,21,null,4,1450,"Y25_empty",5,null,"n/a",null,null,"FEAE (T)Construction Materials",null,null,1.0578000000000001,1.2050000000000001]
[null,"FEAE (L)","Laden","Domestic Intermodal",null,null,51.91973786251755,null,4,1450,"Y25_loaded",5,null,"n/a",null,null,"FEAE (L)Domestic Intermodal",null,null,1.6296999999999999,1.9154]
[null,"FEAE (T)","Unladen","Domestic Intermodal",null,null,20.999936841720363,null,4,1450,"Y25_empty",5,null,"n/a",null,null,"FEAE (T)Domestic Intermodal",null,null,1.1365000000000001,1.2882]
[null,"FEAE (L)","Laden","Domestic Waste",null,null,53.701657816694848,null,4,1450,"Y25_loaded",5,null,"n/a",null,null,"FEAE (L)Domestic Waste",null,null,1.4338,1.8382000000000001]
[null,"FEAE (T)","Unladen","Domestic Waste",null,null,21,null,4,1450,"Y25_empty",5,null,"n/a",null,null,"FEAE (T)Domestic Waste",null,null,1.0933999999999999,1.1012]
[null,"FEAF (L)","Laden","Industrial Minerals",null,null,66.751592356687894,null,4,1450,"Y25_loaded",5,null,"n/a",null,null,"FEAF (L)Industrial Minerals",null,null,1.91,2.2549000000000001]
[null,"FEAF (L)","Laden","Other",null,null,69.159669649002069,null,4,1450,"Y25_loaded",5,null,"n/a",null,null,"FEAF (L)Other",null,null,1.9894000000000001,2.5070999999999999]
[null,"FEAG (L)","Laden","Domestic Intermodal",null,null,47,null,4,1319,"Y25_loaded",5,null,"n/a",null,null,"FEAG (L)Domestic Intermodal"]
[null,"FEAG (T)","Unladen","Domestic Intermodal",null,null,21.8,null,4,1319,"Y25_empty",5,null,"n/a",null,null,"FEAG (T)Domestic Intermodal"]
[null,"FEAG (L)","Laden","Industrial Minerals",null,null,47,null,4,1319,"Y25_loaded",5,null,"n/a",null,null,"FEAG (L)Industrial Minerals"]
[null,"FEAG (T)","Unladen","Industrial Minerals",null,null,21.8,null,4,1319,"Y25_empty",5,null,"n/a",null,null,"FEAG (T)Industrial Minerals"]
[null,"FEAG (L)","Laden","Other",null,null,47,null,4,1319,"Y25_loaded",5,null,"n/a",null,null,"FEAG (L)Other"]
[null,"FEAG (T)","Unladen","Other",null,null,21.8,null,4,1319,"Y25_empty",5,null,"n/a",null,null,"FEAG (T)Other"]
[null,"FEAS (L)","Laden","Construction Materials",null,null,56.380894396551724,null,4,1450,"Y25_loaded",5,null,"n/a",null,null,"FEAS (L)Construction Materials",null,null,1.4347000000000001,2.0062000000000002]
[null,"FEAS (T)","Unladen","Construction Materials",null,null,22.222305017386983,null,4,1450,"Y25_empty",5,null,"n/a",null,null,"FEAS (T)Construction Materials",null,null,1.0643,1.2001999999999999]
[null,"FEAS (L)","Laden","Domestic Intermodal",null,null,51.127334040877813,null,4,1450,"Y25_loaded",5,null,"n/a",null,null,"FEAS (L)Domestic Intermodal",null,null,1.5507,1.8906000000000001]
[null,"FEAS (T)","Unladen","Domestic Intermodal",null,null,20,null,4,1450,"Y25_empty",5,null,"n/a",null,null,"FEAS (T)Domestic Intermodal",null,null,1.1409,1.2986]
[null,"FFAG (L)","Laden","Domestic Intermodal",null,null,33.5,null,4,1502,"FFAG (L)","n/a",null,0.88900000000000001,"published on the supplements list in early 2023 (Files here)",null,"FFAG (L)Domestic Intermodal"]
[null,"FFAG (T)","Unladen","Domestic Intermodal",null,null,18.5,null,4,1502,"FFAG (T)","n/a",null,0.86899999999999999,"published on the supplements list in early 2023 (Files here)",null,"FFAG (T)Domestic Intermodal"]
[null,"FFAG (L)","Laden","Domestic Waste",null,null,33.5,null,4,1502,"FFAG (L)","n/a",null,0.88900000000000001,"published on the supplements list in early 2023 (Files here)",null,"FFAG (L)Domestic Waste"]
[null,"FFAG (T)","Unladen","Domestic Waste",null,null,18.5,null,4,1502,"FFAG (T)","n/a",null,0.86899999999999999,"published on the supplements list in early 2023 (Files here)",null,"FFAG (T)Domestic Waste"]
[null,"FFAG (L)","Laden","European Intermodal",null,null,33.5,null,4,1502,"FFAG (L)","n/a",null,0.88900000000000001,null,null,"FFAG (L)European Intermodal"]
[null,"FFAG (T)","Unladen","European Intermodal",null,null,18.5,null,4,1502,"FFAG (T)","n/a",null,0.86899999999999999,null,null,"FFAG (T)European Intermodal"]
[null,"FIAB (T)","Unladen","Domestic Automotive",null,null,37,null,8,1292,"Y25_empty",5,null,"n/a",null,null,"FIAB (T)Domestic Automotive",null,null,0.97960000000000003,0.85070000000000001]
[null,"FIAB (L)","Laden","Domestic Intermodal",null,null,65.653650507843423,null,8,1292,"Y25_loaded",5,null,"n/a",null,null,"FIAB (L)Domestic Intermodal",null,null,1.7114,1.2592000000000001]
[null,"FIAB (T)","Unladen","Domestic Intermodal",null,null,37,null,8,1292,"Y25_empty",5,null,"n/a",null,null,"FIAB (T)Domestic Intermodal",null,null,1.0307999999999999,1.0035000000000001]
[null,"FIAB (L)","Laden","Enterprise",null,null,48,null,8,1292,"Y25_loaded",5,null,"n/a",null,null,"FIAB (L)Enterprise",null,null,1.5330999999999999,1.0934999999999999]
[null,"FIAB (T)","Unladen","Enterprise",null,null,37,null,8,1292,"Y25_empty",5,null,"n/a",null,null,"FIAB (T)Enterprise",null,null,1.0113000000000001,0.88890000000000002]
[null,"FIAB (L)","Laden","European Conventional",null,null,43,null,8,1292,"Y25_loaded",5,null,"n/a",null,null,"FIAB (L)European Conventional",null,null,1.504,1.1521999999999999]
[null,"FIAB (T)","Unladen","European Conventional",null,null,37,null,8,1292,"Y25_empty",5,null,"n/a",null,null,"FIAB (T)European Conventional",null,null,1.0378000000000001,0.96530000000000005]
[null,"FIAB (L)","Laden","European Intermodal",null,null,88.906433259083911,null,8,1292,"Y25_loaded",5,null,"n/a",null,null,"FIAB (L)European Intermodal",null,null,1.7551000000000001,1.5603]
[null,"FIAB (T)","Unladen","European Intermodal",null,null,37,null,8,1292,"Y25_empty",5,null,"n/a",null,null,"FIAB (T)European Intermodal",null,null,1.0645,1.0992]
[null,"FIAB (T)","Unladen","Industrial Minerals",null,null,37,null,8,1292,"Y25_empty",5,null,"n/a",null,null,"FIAB (T)Industrial Minerals",null,null,0.89470000000000005,0.71730000000000005]
[null,"FIAB (L)","Laden","Other",null,null,45.6,null,8,1292,"Y25_loaded",5,null,"n/a",null,null,"FIAB (L)Other",null,null,1.4265000000000001,1.0569]
[null,"FIAB (T)","Unladen","Other",null,null,37,null,8,1292,"Y25_empty",5,null,"n/a",null,null,"FIAB (T)Other",null,null,0.93899999999999995,0.85070000000000001]
[null,"FIAB (L)","Laden","Steel",null,null,44.233870967741936,null,8,1292,"Y25_loaded",5,null,"n/a",null,null,"FIAB (L)Steel",null,null,1.5377000000000001,1.0542]
[null,"FIAB (T)","Unladen","Steel",null,null,37,null,8,1292,"Y25_empty",5,null,"n/a",null,null,"FIAB (T)Steel",null,null,0.94310000000000005,0.85070000000000001]
[null,"FIAD (L)","Laden","Domestic Automotive",null,null,45,null,4,1292,"Y25_loaded",5,null,"n/a","Retain. Potential future use. GBRf",null,"FIAD (L)Domestic Automotive",null,null,1.7364999999999999,1.6057999999999999]
[null,"FIAD (L)","Laden","Enterprise",null,null,44.020475020475018,null,4,1292,"Y25_loaded",5,null,"n/a",null,null,"FIAD (L)Enterprise",null,null,1.6781999999999999,1.6077999999999999]
[null,"FIAD (L)","Laden","European Intermodal",null,null,44.100511073253834,null,4,1292,"Y25_loaded",5,null,"n/a","Retain. Potential future use. GBRf",null,"FIAD (L)European Intermodal",null,null,1.8327,1.7431000000000001]
[null,"FIAD (L)","Laden","Other",null,null,44.642301313943108,null,4,1292,"Y25_loaded",5,null,"n/a","Retain. Potential future use. GBRf",null,"FIAD (L)Other",null,null,1.5768,1.5978000000000001]
[null,"FKAA (T)","Unladen","Domestic Automotive",null,null,48.943654413737598,null,8,1077,"Y25_empty",5,null,"n/a",null,null,"FKAA (T)Domestic Automotive",null,null,1.0005999999999999,0.88660000000000005]
[null,"FKAA (L)","Laden","Domestic Intermodal",null,null,76.618245541271875,null,8,1077,"Y25_loaded",5,null,"n/a",null,null,"FKAA (L)Domestic Intermodal",null,null,1.6142000000000001,1.3140000000000001]
[null,"FKAA (T)","Unladen","Domestic Intermodal",null,null,48.970771016812137,null,8,1077,"Y25_empty",5,null,"n/a",null,null,"FKAA (T)Domestic Intermodal",null,null,1.0288999999999999,0.97060000000000002]
[null,"FKAA (L)","Laden","Enterprise",null,null,85.092749171146536,null,8,1077,"Y25_loaded",5,null,"n/a",null,null,"FKAA (L)Enterprise",null,null,1.5202,1.3574999999999999]
[null,"FKAA (T)","Unladen","Enterprise",null,null,48.957532725376048,null,8,1077,"Y25_empty",5,null,"n/a",null,null,"FKAA (T)Enterprise",null,null,1.0297000000000001,0.90749999999999997]
[null,"FKAA (L)","Laden","Industrial Minerals",null,null,80.776353276353262,null,8,1077,"Y25_loaded",5,null,"n/a",null,null,"FKAA (L)Industrial Minerals",null,null,1.3617999999999999,1.2282]
[null,"FKAA (T)","Unladen","Industrial Minerals",null,null,49,null,8,1077,"Y25_empty",5,null,"n/a",null,null,"FKAA (T)Industrial Minerals",null,null,0.93110000000000004,0.81430000000000002]
[null,"FKAA (L)","Laden","Other",null,null,80.449760402765989,null,8,1077,"Y25_loaded",5,null,"n/a",null,null,"FKAA (L)Other",null,null,1.4174,1.2845]
[null,"FKAA (T)","Unladen","Other",null,null,48.983821660426614,null,8,1077,"Y25_empty",5,null,"n/a",null,null,"FKAA (T)Other",null,null,0.95530000000000004,0.88680000000000003]
[null,"FKAA (L)","Laden","Steel",null,null,79.2,null,8,1077,"Y25_loaded",5,null,"n/a",null,null,"FKAA (L)Steel"]
[null,"FKAA (T)","Unladen","Steel",null,null,48.94,null,8,1077,"Y25_empty",5,null,"n/a",null,null,"FKAA (T)Steel"]
[null,"FLAB (L)","Laden","Domestic Intermodal",null,null,33.453937422956024,null,4,720,"Y25_loaded",5,null,"n/a",null,null,"FLAB (L)Domestic Intermodal",null,null,1.2132000000000001,1.4011]
[null,"FLAB (T)","Unladen","Domestic Intermodal",null,null,16.999968756771466,null,4,720,"Y25_empty",5,null,"n/a",null,null,"FLAB (T)Domestic Intermodal",null,null,0.98440000000000005,1.0471999999999999]
[null,"FLAI (L)","Laden","Domestic Intermodal",null,null,33.28732046910519,null,4,850,"Y25_loaded",6,null,"n/a",null,null,"FLAI (L)Domestic Intermodal",null,null,1.1972,1.3895]
[null,"FLAI (T)","Unladen","Domestic Intermodal",null,null,17,null,4,850,"Y25_empty",6,null,"n/a",null,null,"FLAI (T)Domestic Intermodal",null,null,1.0021,1.0783]
[null,"FLAJ (L)","Laden","Domestic Intermodal",null,null,33.251565248887509,null,4,850,"Y25_loaded",6,null,"n/a",null,null,"FLAJ (L)Domestic Intermodal",null,null,1.2005999999999999,1.3892]
[null,"FLAJ (T)","Unladen","Domestic Intermodal",null,null,17,null,4,850,"Y25_empty",6,null,"n/a",null,null,"FLAJ (T)Domestic Intermodal",null,null,1.0021,1.0783]
[null,"FLAO (L)","Laden","Domestic Intermodal",null,null,33.425028720307985,null,4,850,"Y25_loaded",6,null,"n/a",null,null,"FLAO (L)Domestic Intermodal",null,null,1.1982999999999999,1.3908]
[null,"FLAO (T)","Unladen","Domestic Intermodal",null,null,17,null,4,850,"Y25_empty",6,null,"n/a",null,null,"FLAO (T)Domestic Intermodal",null,null,1.0021,1.0783]
[null,"FLAP (L)","Laden","Domestic Intermodal",null,null,33.623953608915386,null,4,850,"Y25_loaded",6,null,"n/a",null,null,"FLAP (L)Domestic Intermodal",null,null,1.2022999999999999,1.3926000000000001]
[null,"FLAP (T)","Unladen","Domestic Intermodal",null,null,17,null,4,850,"Y25_empty",6,null,"n/a",null,null,"FLAP (T)Domestic Intermodal",null,null,1.0021,1.0783]
[null,"FNAC (L)","Laden","Other",null,null,77.761000133087776,null,4,1764,"Y25_loaded",5,null,"n/a",null,null,"FNAC (L)Other",null,null,2.1046999999999998,3.0405000000000002]
[null,"FNAC (T)","Unladen","Other",null,null,25,null,4,1764,"Y25_empty",5,null,"n/a",null,null,"FNAC (T)Other",null,null,1.0899000000000001,1.1677]
[null,"FNAD (L)","Laden","Other",null,null,75.599999999999994,null,4,1473,"Y25_Loaded","n/a",null,0.86321999999999999,null,null,"FNAD (L)Other",null,null,1.8358000000000001,2.6983999999999999]
[null,"FNAD (T)","Unladen","Other",null,null,22.3,null,4,1473,"Y25_Empty","n/a",null,0.85587000000000002,null,null,"FNAD (T)Other",null,null,0.98329999999999995,1.0640000000000001]
[null,"FQAI (L)","Laden","Domestic Intermodal",null,null,44.9,null,4,1800,"NACO_loaded",4,null,"n/a","Unsprung changed from 1.82 to 1.80 (6.10.23)",null,"FQAI (L)Domestic Intermodal"]
[null,"FQAI (T)","Unladen","Domestic Intermodal",null,null,25,null,4,1800,"NACO_empty",4,null,"n/a","Unsprung changed from 1.82 to 1.80 (6.10.23)",null,"FQAI (T)Domestic Intermodal"]
[null,"FQAI (L)","Laden","Enterprise",null,null,42.74,null,4,1800,"NACO_loaded",4,null,"n/a","Unsprung changed from 1.82 to 1.80 (6.10.23)",null,"FQAI (L)Enterprise"]
[null,"FQAI (T)","Unladen","Enterprise",null,null,25,null,4,1800,"NACO_empty",4,null,"n/a","Unsprung changed from 1.82 to 1.80 (6.10.23)",null,"FQAI (T)Enterprise"]
[null,"FQAO (L)","Laden","Domestic Intermodal",null,null,44.9,null,4,1800,"NACO_loaded",4,null,"n/a","Unsprung changed from 1.82 to 1.80 (6.10.23)",null,"FQAO (L)Domestic Intermodal",null,null,2.8148,3.8218999999999999]
[null,"FQAO (T)","Unladen","Domestic Intermodal",null,null,25,null,4,1800,"NACO_empty",4,null,"n/a","Unsprung changed from 1.82 to 1.80 (6.10.23)",null,"FQAO (T)Domestic Intermodal",null,null,1.4092,1.6479999999999999]
[null,"FQAO (L)","Laden","Enterprise",null,null,42.74,null,4,1800,"NACO_loaded",4,null,"n/a","Unsprung changed from 1.82 to 1.80 (6.10.23)",null,"FQAO (L)Enterprise",null,null,2.7399,3.7652000000000001]
[null,"FQAO (T)","Unladen","Enterprise",null,null,25,null,4,1800,"NACO_empty",4,null,"n/a","Unsprung changed from 1.82 to 1.80 (6.10.23)",null,"FQAO (T)Enterprise",null,null,1.3804000000000001,1.4901]
[null,"FRAA (L)","Laden","Domestic Waste",null,null,53.7,null,4,1344,"Y25_loaded",5,null,"n/a",null,null,"FRAA (L)Domestic Waste",null,null,1.492,1.8331]
[null,"FRAA (T)","Unladen","Domestic Waste",null,null,19,null,4,1344,"Y25_empty",5,null,"n/a",null,null,"FRAA (T)Domestic Waste",null,null,1.0818000000000001,1.0928]
[null,"FSAO (L)","Laden","Domestic Intermodal",null,null,46.394997682277079,null,4,1500,"Y25_loaded",5,null,"n/a",null,null,"FSAO (L)Domestic Intermodal",null,null,1.4442999999999999,1.7672000000000001]
[null,"FSAO (T)","Unladen","Domestic Intermodal",null,null,21,null,4,1500,"Y25_empty",5,null,"n/a",null,null,"FSAO (T)Domestic Intermodal",null,null,1.1463000000000001,1.3049999999999999]
[null,"FSAO (L)","Laden","Domestic Waste",null,null,46.4,null,4,1500,"Y25_loaded",5,null,"n/a",null,null,"FSAO (L)Domestic Waste"]
[null,"FSAO (T)","Unladen","Domestic Waste",null,null,20.8,null,4,1500,"Y25_empty",5,null,"n/a",null,null,"FSAO (T)Domestic Waste"]
[null,"FTAI (L)","Laden","Domestic Intermodal",null,null,42.327189967149074,null,4,1500,"Y25_loaded",5,null,"n/a",null,null,"FTAI (L)Domestic Intermodal",null,null,1.3824000000000001,1.6789000000000001]
[null,"FTAI (T)","Unladen","Domestic Intermodal",null,null,21,null,4,1500,"Y25_empty",5,null,"n/a",null,null,"FTAI (T)Domestic Intermodal",null,null,1.1464000000000001,1.3049999999999999]
[null,"FWAA (L)","Laden","Construction Materials",null,null,41.9,null,4,1380,"Y25_loaded",5,null,"n/a",null,null,"FWAA (L)Construction Materials"]
[null,"FWAA (T)","Unladen","Construction Materials",null,null,21,null,4,1380,"Y25_empty",5,null,"n/a",null,null,"FWAA (T)Construction Materials"]
[null,"FWAA (L)","Laden","Domestic Intermodal",null,null,37.9,null,4,1380,"Y25_loaded","n/a",null,0.86799999999999999,null,null,"FWAA (L)Domestic Intermodal",null,null,1.3467,1.5053000000000001]
[null,"FWAA (T)","Unladen","Domestic Intermodal",null,null,21.9,null,4,1380,"Y25_empty","n/a",null,0.85599999999999998,null,null,"FWAA (T)Domestic Intermodal",null,null,1.0787,1.1875]
[null,"FWAA (L)","Laden","Industrial Minerals",null,null,36.9,null,4,1380,"Y25_loaded",5,null,"n/a",null,null,"FWAA (L)Industrial Minerals"]
[null,"FWAA (T)","Unladen","Industrial Minerals",null,null,21.9,null,4,1380,"Y25_empty",5,null,"n/a",null,null,"FWAA (T)Industrial Minerals"]
[null,"FWAA (L)","Laden","Other",null,null,41.9,null,4,1380,"Y25_loaded",5,null,"n/a",null,null,"FWAA (L)Other"]
[null,"FWAA (T)","Unladen","Other",null,null,21,null,4,1380,"Y25_empty",5,null,"n/a",null,null,"FWAA (T)Other"]
[null,"FWAB (L)","Laden","Construction Materials",null,null,36,null,4,1377,"Y25_loaded","n/a",null,0.875,null,null,"FWAB (L)Construction Materials"]
[null,"FWAB (T)","Unladen","Construction Materials",null,null,21,null,4,1377,"Y25_empty","n/a",null,0.85599999999999998,null,null,"FWAB (T)Construction Materials"]
[null,"FWAB (L)","Laden","Domestic Intermodal",null,null,55,null,4,1377,"Y25_Loaded","n/a",null,0.875,null,null,"FWAB (L)Domestic Intermodal",null,null,1.5515000000000001,1.9085000000000001]
[null,"FWAB (T)","Unladen","Domestic Intermodal",null,null,21,null,4,1377,"Y25_Empty","n/a",null,0.85599999999999998,null,null,"FWAB (T)Domestic Intermodal",null,null,1.0588,1.1935]
[null,"FWAB (L)","Laden","Industrial Minerals",null,null,36,null,4,1377,"Y25_Loaded",5,null,"n/a",null,null,"FWAB (L)Industrial Minerals"]
[null,"FWAB (T)","Unladen","Industrial Minerals",null,null,21,null,4,1377,"Y25_Empty",5,null,"n/a",null,null,"FWAB (T)Industrial Minerals"]
[null,"FWAB (L)","Laden","Other",null,null,36,null,4,1377,"Y25_loaded","n/a",null,0.875,null,null,"FWAB (L)Other"]
[null,"FWAB (T)","Unladen","Other",null,null,21,null,4,1377,"Y25_empty","n/a",null,0.85599999999999998,null,null,"FWAB (T)Other"]
[null,"FWAC (L)","Laden","Construction Materials",null,null,35.619999999999997,null,4,1413,"FWAC (L)","n/a",null,0.88,null,null,"FWAC (L)Construction Materials"]
[null,"FWAC (T)","Unladen","Construction Materials",null,null,21,null,4,1413,"FWAC (T)","n/a",null,0.86799999999999999,null,null,"FWAC (T)Construction Materials"]
[null,"FWAC (L)","Laden","Domestic Intermodal",null,null,35.619999999999997,null,4,1413,"FWAC (L)","n/a",null,0.88,null,null,"FWAC (L)Domestic Intermodal"]
[null,"FWAC (T)","Unladen","Domestic Intermodal",null,null,21,null,4,1413,"FWAC (T)","n/a",null,0.86799999999999999,null,null,"FWAC (T)Domestic Intermodal"]
[null,"FWAC (L)","Laden","Other",null,null,35.619999999999997,null,4,1413,"FWAC (L)","n/a",null,0.88,null,null,"FWAC (L)Other"]
[null,"FWAC (T)","Unladen","Other",null,null,21,null,4,1413,"FWAC (T)","n/a",null,0.86799999999999999,null,null,"FWAC (T)Other"]
[null,"FWAD (L)","Laden","Construction Materials",null,null,40.909999999999997,null,4,1413,"FWAD (L)","n/a",null,0.88,null,null,"FWAD (L)Construction Materials"]
[null,"FWAD (T)","Unladen","Construction Materials",null,null,21,null,4,1413,"FWAD (T)","n/a",null,0.86799999999999999,null,null,"FWAD (T)Construction Materials"]
[null,"FWAD (L)","Laden","Domestic Intermodal",null,null,40.909999999999997,null,4,1413,"FWAD (L)","n/a",null,0.88,null,null,"FWAD (L)Domestic Intermodal"]
[null,"FWAD (T)","Unladen","Domestic Intermodal",null,null,21,null,4,1413,"FWAD (T)","n/a",null,0.86799999999999999,null,null,"FWAD (T)Domestic Intermodal"]
[null,"FWAD (L)","Laden","Other",null,null,40.909999999999997,null,4,1413,"FWAD (L)","n/a",null,0.88,null,null,"FWAD (L)Other"]
[null,"FWAD (T)","Unladen","Other",null,null,21,null,4,1413,"FWAD (T)","n/a",null,0.86799999999999999,null,null,"FWAD (T)Other"]
[null,"FXAC (L)","Laden","Domestic Intermodal",null,null,48.45,null,4,1800,"NACO_loaded",4,null,"n/a","Unsprung changed from 1.82 to  1.80 (6.10.23)",null,"FXAC (L)Domestic Intermodal",null,null,2.7810000000000001,3.7645]
[null,"FXAC (T)","Unladen","Domestic Intermodal",null,null,24.9,null,4,1800,"NACO_empty",4,null,"n/a","Unsprung changed from 1.82 to  1.80 (6.10.23)",null,"FXAC (T)Domestic Intermodal",null,null,1.4094,1.6493]
[null,"FXAC (L)","Laden","Domestic Waste",null,null,58.6,null,4,1800,"NACO_loaded",4,null,"n/a","Unsprung changed from 1.82 to  1.80 (6.10.23)",null,"FXAC (L)Domestic Waste",null,null,2.6423000000000001,3.6137999999999999]
[null,"FXAC (T)","Unladen","Domestic Waste",null,null,24.9,null,4,1800,"NACO_empty",4,null,"n/a","Unsprung changed from 1.82 to  1.80 (6.10.23)",null,"FXAC (T)Domestic Waste",null,null,1.3535999999999999,1.4117]
[null,"FXAC (L)","Laden","Enterprise",null,null,48.45,null,4,1800,"NACO_loaded",4,null,"n/a","Unsprung changed from 1.82 to  1.80 (6.10.23)",null,"FXAC (L)Enterprise",null,null,2.6680999999999999,3.6528]
[null,"FXAC (T)","Unladen","Enterprise",null,null,24.9,null,4,1800,"NACO_empty",4,null,"n/a","Unsprung changed from 1.82 to  1.80 (6.10.23)",null,"FXAC (T)Enterprise",null,null,1.3804000000000001,1.4907999999999999]
[null,"FXAC (L)","Laden","Other",null,null,48.45,null,4,1800,"NACO_loaded",4,null,"n/a","Unsprung changed from 1.82 to  1.80 (6.10.23)",null,"FXAC (L)Other",null,null,2.5897000000000001,3.6162999999999998]
[null,"FXAC (T)","Unladen","Other",null,null,24.9,null,4,1800,"NACO_empty",4,null,"n/a","Unsprung changed from 1.82 to  1.80 (6.10.23)",null,"FXAC (T)Other",null,null,1.2871999999999999,1.4380999999999999]
[null,"FYAB (T)","Unladen","Domestic Automotive",null,null,25,null,4,1820,"NACO_empty",4,null,"n/a",null,null,"FYAB (T)Domestic Automotive",null,null,1.3381000000000001,1.4375]
[null,"FYAB (L)","Laden","Domestic Intermodal",null,null,43.949506063630672,null,4,1820,"NACO_loaded",4,null,"n/a",null,null,"FYAB (L)Domestic Intermodal",null,null,2.8052999999999999,3.8441999999999998]
[null,"FYAB (T)","Unladen","Domestic Intermodal",null,null,25.000005471970617,null,4,1820,"NACO_empty",4,null,"n/a",null,null,"FYAB (T)Domestic Intermodal",null,null,1.4092,1.6479999999999999]
[null,"FYAB (L)","Laden","Domestic Waste",null,null,48.49647887323944,null,4,1820,"NACO_loaded",4,null,"n/a",null,null,"FYAB (L)Domestic Waste",null,null,2.6503999999999999,3.5977999999999999]
[null,"FYAB (T)","Unladen","Domestic Waste",null,null,25,null,4,1820,"NACO_empty",4,null,"n/a",null,null,"FYAB (T)Domestic Waste",null,null,1.3536999999999999,1.4113]
[null,"FYAB (L)","Laden","Enterprise",null,null,61.210321636089127,null,4,1820,"NACO_loaded",4,null,"n/a",null,null,"FYAB (L)Enterprise",null,null,2.6943000000000001,3.7176]
[null,"FYAB (T)","Unladen","Enterprise",null,null,25,null,4,1820,"NACO_empty",4,null,"n/a",null,null,"FYAB (T)Enterprise",null,null,1.3804000000000001,1.4901]
[null,"FYAB (L)","Laden","Industrial Minerals",null,null,49.34939091915836,null,4,1820,"NACO_loaded",4,null,"n/a",null,null,"FYAB (L)Industrial Minerals",null,null,2.5472000000000001,3.4830000000000001]
[null,"FYAB (T)","Unladen","Industrial Minerals",null,null,25,null,4,1820,"NACO_empty",4,null,"n/a",null,null,"FYAB (T)Industrial Minerals",null,null,1.2251000000000001,1.2541]
[null,"FYAB (L)","Laden","Other",null,null,49.014804290035748,null,4,1820,"NACO_loaded",4,null,"n/a",null,null,"FYAB (L)Other",null,null,2.5882999999999998,3.6105]
[null,"FYAB (T)","Unladen","Other",null,null,25,null,4,1820,"NACO_empty",4,null,"n/a",null,null,"FYAB (T)Other",null,null,1.2871999999999999,1.4375]
[null,"FZAA (T)","Unladen","Other",null,null,33,null,4,1344,"Y25_empty",5,null,"n/a",null,null,"FZAA (T)Other",null,null,1.4195,1.1991000000000001]
[null,"HHAA (L)","Laden","Coal ESI",null,null,97.938966083928733,null,4,1330,"LN25_loaded",6,null,"n/a",null,null,"HHAA (L)Coal ESI",null,null,2.7562000000000002,4.6368]
[null,"HHAA (T)","Unladen","Coal ESI",null,null,28,null,4,1330,"LN25_empty",6,null,"n/a",null,null,"HHAA (T)Coal ESI",null,null,1.0223,1.0447]
[null,"HHAA (L)","Laden","Coal Other",null,null,97.857404098791378,null,4,1330,"LN25_loaded",6,null,"n/a",null,null,"HHAA (L)Coal Other",null,null,2.8605999999999998,4.6714000000000002]
[null,"HHAA (T)","Unladen","Coal Other",null,null,28,null,4,1330,"LN25_empty",6,null,"n/a",null,null,"HHAA (T)Coal Other",null,null,1.0266999999999999,1.0582]
[null,"HHAA (L)","Laden","Construction Materials",null,null,98,null,4,1330,"LN25_loaded",6,null,"n/a",null,null,"HHAA (L)Construction Materials",null,null,2.9186999999999999,4.8718000000000004]
[null,"HHAA (T)","Unladen","Construction Materials",null,null,28,null,4,1330,"LN25_empty",6,null,"n/a",null,null,"HHAA (T)Construction Materials",null,null,1.0451999999999999,1.1123000000000001]
[null,"HHAA (L)","Laden","Other",null,null,99.159186535764391,null,4,1330,"LN25_loaded",6,null,"n/a",null,null,"HHAA (L)Other",null,null,2.9121000000000001,4.8211000000000004]
[null,"HHAA (T)","Unladen","Other",null,null,28,null,4,1330,"LN25_empty",6,null,"n/a",null,null,"HHAA (T)Other",null,null,1.0266999999999999,1.0582]
[null,"HHAB (L)","Laden","Coal ESI",null,null,97.974295772693679,null,4,1330,"LN25_loaded",6,null,"n/a",null,null,"HHAB (L)Coal ESI",null,null,2.7574999999999998,4.6406999999999998]
[null,"HHAB (T)","Unladen","Coal ESI",null,null,28,null,4,1330,"LN25_empty",6,null,"n/a",null,null,"HHAB (T)Coal ESI",null,null,1.0223,1.0447]
[null,"HHAB (L)","Laden","Coal Other",null,null,77.731788892983573,null,4,1330,"LN25_loaded",6,null,"n/a",null,null,"HHAB (L)Coal Other",null,null,2.2816000000000001,2.9089]
[null,"HHAB (T)","Unladen","Coal Other",null,null,28,null,4,1330,"LN25_empty",6,null,"n/a",null,null,"HHAB (T)Coal Other",null,null,1.0266999999999999,1.0582]
[null,"HHAB (L)","Laden","Construction Materials",null,null,98,null,4,1330,"LN25_loaded",6,null,"n/a",null,null,"HHAB (L)Construction Materials",null,null,2.9186999999999999,4.8718000000000004]
[null,"HHAB (T)","Unladen","Construction Materials",null,null,28,null,4,1330,"LN25_empty",6,null,"n/a",null,null,"HHAB (T)Construction Materials",null,null,1.0451999999999999,1.1123000000000001]
[null,"HHAB (L)","Laden","Other",null,null,99.303853442830075,null,4,1330,"LN25_loaded",6,null,"n/a",null,null,"HHAB (L)Other",null,null,2.9847999999999999,4.8380999999999998]
[null,"HHAB (T)","Unladen","Other",null,null,28,null,4,1330,"LN25_empty",6,null,"n/a",null,null,"HHAB (T)Other",null,null,1.0266999999999999,1.0582]
[null,"HHAE (L)","Laden","Construction Materials",null,null,95.4,null,4,1330,"LN25_loaded",6,null,"n/a",null,null,"HHAE (L)Construction Materials"]
[null,"HHAE (T)","Unladen","Construction Materials",null,null,24.48,null,4,1330,"LN25_empty",6,null,"n/a",null,null,"HHAE (T)Construction Materials"]
[null,"HHAE (L)","Laden","Other",null,null,95.4,null,4,1330,"LN25_loaded",6,null,"n/a",null,null,"HHAE (L)Other"]
[null,"HHAE (T)","Unladen","Other",null,null,24.48,null,4,1330,"LN25_empty",6,null,"n/a",null,null,"HHAE (T)Other"]
[null,"HIAA (L)","Laden","Coal ESI",null,null,85.609756097560975,null,4,1500,"Y25_loaded",5,null,"n/a",null,null,"HIAA (L)Coal ESI",null,null,2.2970999999999999,3.5956999999999999]
[null,"HIAA (T)","Unladen","Coal ESI",null,null,23.386744030350368,null,4,1500,"Y25_empty",5,null,"n/a",null,null,"HIAA (T)Coal ESI",null,null,1.0486,1.1097999999999999]
[null,"HIAA (L)","Laden","Coal Other",null,null,89,null,4,1500,"Y25_loaded",5,null,"n/a",null,null,"HIAA (L)Coal Other",null,null,2.4857999999999998,3.9281999999999999]
[null,"HIAA (T)","Unladen","Coal Other",null,null,23.232876712328768,null,4,1500,"Y25_empty",5,null,"n/a",null,null,"HIAA (T)Coal Other",null,null,1.0558000000000001,1.1294]
[null,"HIAA (L)","Laden","Construction Materials",null,null,87.528435727089146,null,4,1500,"Y25_loaded",5,null,"n/a",null,null,"HIAA (L)Construction Materials",null,null,2.4834000000000001,3.9361999999999999]
[null,"HIAA (T)","Unladen","Construction Materials",null,null,23.396993117918058,null,4,1500,"Y25_empty",5,null,"n/a",null,null,"HIAA (T)Construction Materials",null,null,1.0817000000000001,1.2094]
[null,"HIAA (T)","Unladen","Other",null,null,23,null,4,1500,"Y25_empty",5,null,"n/a",null,null,"HIAA (T)Other",null,null,1.0547,1.1289]
[null,"HJAI (L)","Laden","Construction Materials",null,null,97.71780345273676,null,4,1330,"LN25_loaded","n/a",null,0.86899999999999999,null,null,"HJAI (L)Construction Materials",null,null,2.7976999999999999,4.7145999999999999]
[null,"HJAI (T)","Unladen","Construction Materials",null,null,23,null,4,1330,"LN25_empty","n/a",null,0.88300000000000001,null,null,"HJAI (T)Construction Materials",null,null,1.0193000000000001,1.0728]
[null,"HJAI (T)","Unladen","Enterprise",null,null,23,null,4,1330,"LN25_empty","n/a",null,0.88300000000000001,null,null,"HJAI (T)Enterprise",null,null,1.0712999999999999,1.0416000000000001]
[null,"HJAO (L)","Laden","Construction Materials",null,null,95.869406979233574,null,4,1330,"LN25_loaded","n/a",null,0.86899999999999999,null,null,"HJAO (L)Construction Materials",null,null,2.7,4.5076999999999998]
[null,"HJAO (T)","Unladen","Construction Materials",null,null,23,null,4,1330,"LN25_empty","n/a",null,0.88300000000000001,null,null,"HJAO (T)Construction Materials",null,null,1.0193000000000001,1.0728]
[null,"HJAO (T)","Unladen","Enterprise",null,null,23,null,4,1330,"LN25_empty","n/a",null,0.88300000000000001,null,null,"HJAO (T)Enterprise",null,null,1.0712999999999999,1.0416000000000001]
[null,"HLAA (L)","Laden","Construction Materials",null,null,95.611688720856961,null,4,2235,"3piece_loaded",3,null,"n/a",null,null,"HLAA (L)Construction Materials",null,null,3.7450999999999999,5.9606000000000003]
[null,"HLAA (T)","Unladen","Construction Materials",null,null,25.449131731275212,null,4,2235,"3piece_empty",3,null,"n/a",null,null,"HLAA (T)Construction Materials",null,null,1.4875,1.7312000000000001]
[null,"HLAB (L)","Laden","Construction Materials",null,null,95.136661043404231,null,4,1330,"LN25_loaded","n/a",null,0.87,null,null,"HLAB (L)Construction Materials",null,null,2.6638000000000002,4.4324000000000003]
[null,"HLAB (T)","Unladen","Construction Materials",null,null,26,null,4,1330,"LN25_empty","n/a",null,0.85599999999999998,null,null,"HLAB (T)Construction Materials",null,null,1.0218,1.0613999999999999]
[null,"HOAA (L)","Laden","Construction Materials",null,null,98.770937781429254,null,4,1330,"LN25_loaded","n/a",null,0.86799999999999999,"No change to VCs (NP 6.10.23)",null,"HOAA (L)Construction Materials",null,null,2.9074,4.8326000000000002]
[null,"HOAA (T)","Unladen","Construction Materials",null,null,25,null,4,1330,"LN25_empty","n/a",null,0.91100000000000003,"No change to VCs (NP 6.10.23)",null,"HOAA (T)Construction Materials",null,null,1.0369999999999999,1.1024]
[null,"HOAA (L)","Laden","Enterprise",null,null,95,null,4,1330,"LN25_loaded","n/a",null,0.86799999999999999,"No change to VCs (NP 6.10.23)",null,"HOAA (L)Enterprise",null,null,2.9056999999999999,4.3236999999999997]
[null,"HOAA (T)","Unladen","Enterprise",null,null,25,null,4,1330,"LN25_empty","n/a",null,0.91100000000000003,"No change to VCs (NP 6.10.23)",null,"HOAA (T)Enterprise",null,null,1.0929,1.0725]
[null,"HOAA (T)","Unladen","Other",null,null,25,null,4,1330,"LN25_empty","n/a",null,0.91100000000000003,"No change to VCs (NP 6.10.23)",null,"HOAA (T)Other",null,null,1.0168999999999999,1.0426]
[null,"HOAB (L)","Laden","Construction Materials",null,null,95.78,null,4,1330,"LN25_Loaded",6,null,"n/a",null,null,"HOAB (L)Construction Materials",null,null,2.7355,4.6161000000000003]
[null,"HOAB (T)","Unladen","Construction Materials",null,null,24,null,4,1330,"LN25_Empty",6,null,"n/a",null,null,"HOAB (T)Construction Materials",null,null,1.026,1.0873999999999999]
[null,"HQAD (L)","Laden","Construction Materials",null,null,88.452773613193415,null,4,1764,"Y25_loaded",5,null,"n/a",null,null,"HQAD (L)Construction Materials",null,null,2.5424000000000002,4.0382999999999996]
[null,"HQAD (T)","Unladen","Construction Materials",null,null,26,null,4,1764,"Y25_empty",5,null,"n/a",null,null,"HQAD (T)Construction Materials",null,null,1.1207,1.2650999999999999]
[null,"HQAD (L)","Laden","Other",null,null,90,null,4,1764,"Y25_loaded",5,null,"n/a",null,null,"HQAD (L)Other",null,null,2.5670000000000002,4.0309999999999997]
[null,"HQAE (L)","Laden","Construction Materials",null,null,89.075184016824409,null,4,1764,"Y25_loaded",5,null,"n/a",null,null,"HQAE (L)Construction Materials",null,null,2.5617999999999999,4.0979999999999999]
[null,"HQAE (T)","Unladen","Construction Materials",null,null,26,null,4,1764,"Y25_empty",5,null,"n/a",null,null,"HQAE (T)Construction Materials",null,null,1.1196999999999999,1.2650999999999999]
[null,"HQAE (L)","Laden","Other",null,null,81.5,null,4,1764,"Y25_loaded",5,null,"n/a",null,null,"HQAE (L)Other",null,null,2.3285,3.3088000000000002]
[null,"HQAF (L)","Laden","Construction Materials",null,null,87.847790507364962,null,4,1764,"Y25_loaded",5,null,"n/a",null,null,"HQAF (L)Construction Materials",null,null,2.4908999999999999,3.9811999999999999]
[null,"HQAF (T)","Unladen","Construction Materials",null,null,28,null,4,1764,"Y25_empty",5,null,"n/a",null,null,"HQAF (T)Construction Materials",null,null,1.1334,1.2722]
[null,"HQAF (L)","Laden","Other",null,null,87,null,4,1764,"Y25_loaded",5,null,"n/a",null,null,"HQAF (L)Other",null,null,2.4420000000000002,3.7570000000000001]
[null,"HQAG (L)","Laden","Construction Materials",null,null,85.11886402106451,null,4,1764,"Y25_loaded",5,null,"n/a",null,null,"HQAG (L)Construction Materials",null,null,2.4502999999999999,3.7349000000000001]
[null,"HQAG (T)","Unladen","Construction Materials",null,null,26,null,4,1764,"Y25_empty",5,null,"n/a",null,null,"HQAG (T)Construction Materials",null,null,1.1196999999999999,1.2650999999999999]
[null,"HQAG (L)","Laden","Other",null,null,90,null,4,1764,"Y25_loaded",5,null,"n/a",null,null,"HQAG (L)Other",null,null,2.5487000000000002,4.0309999999999997]
[null,"HQAG (L)","Laden","Steel",null,null,90,null,4,1764,"Y25_loaded",5,null,"n/a",null,null,"HQAG (L)Steel",null,null,2.5455000000000001,4.0309999999999997]
[null,"HQAH (L)","Laden","Construction Materials",null,null,84.849981200651712,null,4,1764,"Y25_loaded",5,null,"n/a",null,null,"HQAH (L)Construction Materials",null,null,2.4485000000000001,3.7115999999999998]
[null,"HQAH (T)","Unladen","Construction Materials",null,null,26,null,4,1764,"Y25_empty",5,null,"n/a",null,null,"HQAH (T)Construction Materials",null,null,1.1207,1.2650999999999999]
[null,"HQAH (L)","Laden","Other",null,null,90,null,4,1764,"Y25_loaded",5,null,"n/a",null,null,"HQAH (L)Other",null,null,2.5493999999999999,4.0309999999999997]
[null,"HQAJ (L)","Laden","Construction Materials",null,null,85.268895078922938,null,4,1764,"Y25_loaded",5,null,"n/a",null,null,"HQAJ (L)Construction Materials",null,null,2.4281999999999999,3.7480000000000002]
[null,"HQAJ (T)","Unladen","Construction Materials",null,null,27,null,4,1764,"Y25_empty",5,null,"n/a",null,null,"HQAJ (T)Construction Materials",null,null,1.137,1.2678]
[null,"HQAJ (L)","Laden","Other",null,null,88,null,4,1764,"Y25_loaded",5,null,"n/a",null,null,"HQAJ (L)Other",null,null,2.4561000000000002,3.8458999999999999]
[null,"HQAK (L)","Laden","Construction Materials",null,null,87.047992164544567,null,4,1764,"Y25_loaded",5,null,"n/a",null,null,"HQAK (L)Construction Materials",null,null,2.4668000000000001,3.9072]
[null,"HQAK (T)","Unladen","Construction Materials",null,null,28,null,4,1764,"Y25_empty",5,null,"n/a",null,null,"HQAK (T)Construction Materials",null,null,1.1334,1.2722]
[null,"HQAL (L)","Laden","Construction Materials",null,null,87.654274509803926,null,4,1764,"Y25_loaded",5,null,"n/a",null,null,"HQAL (L)Construction Materials",null,null,2.5188999999999999,3.9632000000000001]
[null,"HQAL (T)","Unladen","Construction Materials",null,null,26,null,4,1764,"Y25_empty",5,null,"n/a",null,null,"HQAL (T)Construction Materials",null,null,1.1196999999999999,1.2650999999999999]
[null,"HQAM (L)","Laden","Construction Materials",null,null,87.760941176470595,null,4,1764,"Y25_loaded",5,null,"n/a",null,null,"HQAM (L)Construction Materials",null,null,2.5222000000000002,3.9731000000000001]
[null,"HQAM (T)","Unladen","Construction Materials",null,null,26,null,4,1764,"Y25_empty",5,null,"n/a",null,null,"HQAM (T)Construction Materials",null,null,1.1207,1.2650999999999999]
[null,"HRAI (L)","Laden","Construction Materials",null,null,99.83,null,4,2062,"NACO_loaded",4,null,"n/a",null,null,"HRAI (L)Construction Materials"]
[null,"HRAI (T)","Unladen","Construction Materials",null,null,24.7,null,4,2062,"NACO_empty",4,null,"n/a",null,null,"HRAI (T)Construction Materials"]
[null,"HRAO (L)","Laden","Construction Materials",null,null,98.74,null,4,2062,"NACO_loaded",4,null,"n/a",null,null,"HRAO (L)Construction Materials"]
[null,"HRAO (T)","Unladen","Construction Materials",null,null,24.7,null,4,2062,"NACO_empty",4,null,"n/a",null,null,"HRAO (T)Construction Materials"]
[null,"HTAB (L)","Laden","Coal ESI",null,null,97.541177822646759,null,4,2062,"NACO_loaded",4,null,"n/a",null,null,"HTAB (L)Coal ESI",null,null,3.5891000000000002,5.87]
[null,"HTAB (T)","Unladen","Coal ESI",null,null,26.999060387745036,null,4,2062,"NACO_empty",4,null,"n/a",null,null,"HTAB (T)Coal ESI",null,null,1.3,1.4307000000000001]
[null,"HTAB (L)","Laden","Coal Other",null,null,96.099960716511433,null,4,2062,"NACO_loaded",4,null,"n/a",null,null,"HTAB (L)Coal Other",null,null,3.6829000000000001,5.7614999999999998]
[null,"HTAB (T)","Unladen","Coal Other",null,null,26.998854290226877,null,4,2062,"NACO_empty",4,null,"n/a",null,null,"HTAB (T)Coal Other",null,null,1.3097000000000001,1.4599]
[null,"HTAB (L)","Laden","Construction Materials",null,null,95.943382352941185,null,4,2062,"NACO_loaded",4,null,"n/a",null,null,"HTAB (L)Construction Materials",null,null,3.7048999999999999,5.9363000000000001]
[null,"HTAB (T)","Unladen","Construction Materials",null,null,27,null,4,2062,"NACO_empty",4,null,"n/a",null,null,"HTAB (T)Construction Materials",null,null,1.3493999999999999,1.577]
[null,"HTAB (T)","Unladen","Enterprise",null,null,27.009828009828013,null,4,2062,"NACO_empty",4,null,"n/a",null,null,"HTAB (T)Enterprise",null,null,1.4097999999999999,1.5184]
[null,"HTAB (L)","Laden","Industrial Minerals",null,null,84.614136732329086,null,4,2062,"NACO_loaded",4,null,"n/a",null,null,"HTAB (L)Industrial Minerals",null,null,3.2564000000000002,4.5095000000000001]
[null,"HTAB (T)","Unladen","Industrial Minerals",null,null,27,null,4,2062,"NACO_empty",4,null,"n/a",null,null,"HTAB (T)Industrial Minerals",null,null,1.2407999999999999,1.2557]
[null,"HTAB (T)","Unladen","Other",null,null,27,null,4,2062,"NACO_empty",4,null,"n/a",null,null,"HTAB (T)Other",null,null,1.3099000000000001,1.4599]
[null,"HTAB (L)","Laden","Steel",null,null,71.46595862706522,null,4,2062,"NACO_loaded",4,null,"n/a",null,null,"HTAB (L)Steel",null,null,3.0722999999999998,3.9990999999999999]
[null,"HTAB (T)","Unladen","Steel",null,null,27,null,4,2062,"NACO_empty",4,null,"n/a",null,null,"HTAB (T)Steel",null,null,1.3099000000000001,1.4599]
[null,"HTAD (L)","Laden","Coal ESI",null,null,97.682259459459459,null,4,2062,"NACO_loaded",4,null,"n/a",null,null,"HTAD (L)Coal ESI",null,null,3.589,5.8855000000000004]
[null,"HTAD (T)","Unladen","Coal ESI",null,null,27,null,4,2062,"NACO_empty",4,null,"n/a",null,null,"HTAD (T)Coal ESI",null,null,1.3,1.4307000000000001]
[null,"HTAD (L)","Laden","Coal Other",null,null,96.239998210637765,null,4,2062,"NACO_loaded",4,null,"n/a",null,null,"HTAD (L)Coal Other",null,null,3.6920999999999999,5.7763999999999998]
[null,"HTAD (T)","Unladen","Coal Other",null,null,27,null,4,2062,"NACO_empty",4,null,"n/a",null,null,"HTAD (T)Coal Other",null,null,1.3096000000000001,1.4599]
[null,"HTAD (L)","Laden","Construction Materials",null,null,97,null,4,2062,"NACO_loaded",4,null,"n/a",null,null,"HTAD (L)Construction Materials",null,null,3.7250999999999999,6.0545999999999998]
[null,"HTAD (T)","Unladen","Construction Materials",null,null,27,null,4,2062,"NACO_Empty",4,null,"n/a",null,null,"HTAD (T)Construction Materials",null,null,1.3516999999999999,1.577]
[null,"HTAD (T)","Unladen","Enterprise",null,null,27,null,4,2062,"NACO_empty",4,null,"n/a",null,null,"HTAD (T)Enterprise",null,null,1.4097999999999999,1.5184]
[null,"HTAD (T)","Unladen","Other",null,null,27,null,4,2062,"NACO_empty",4,null,"n/a",null,null,"HTAD (T)Other",null,null,1.3116000000000001,1.4599]
[null,"HTAD (L)","Laden","Steel",null,null,71,null,4,2062,"NACO_loaded",4,null,"n/a",null,null,"HTAD (L)Steel",null,null,3.044,3.98]
[null,"HTAD (T)","Unladen","Steel",null,null,27,null,4,2062,"NACO_empty",4,null,"n/a",null,null,"HTAD (T)Steel",null,null,1.3099000000000001,1.4599]
[null,"HTAE (L)","Laden","Coal ESI",null,null,97.682299999999998,null,4,2062,"NACO_loaded",4,null,"n/a",null,null,"HTAE (L)Coal ESI",null,null,3.5200999999999998,5.8855000000000004]
[null,"HTAE (T)","Unladen","Coal ESI",null,null,27,null,4,2062,"NACO_empty",4,null,"n/a",null,null,"HTAE (T)Coal ESI",null,null,1.3022,1.4307000000000001]
[null,"HTAE (L)","Laden","Coal Other",null,null,97.682299999999998,null,4,2062,"NACO_loaded",4,null,"n/a",null,null,"HTAE (L)Coal Other",null,null,3.6320999999999999,5.9333999999999998]
[null,"HTAE (T)","Unladen","Coal Other",null,null,27,null,4,2062,"NACO_empty",4,null,"n/a",null,null,"HTAE (T)Coal Other",null,null,1.3121,1.4599]
[null,"HTAE (L)","Laden","Construction Materials",null,null,98.422499999999999,null,4,2062,"NACO_loaded",4,null,"n/a",null,null,"HTAE (L)Construction Materials",null,null,3.7298,6.2199]
[null,"HTAE (T)","Unladen","Construction Materials",null,null,27.001000000000001,null,4,2062,"NACO_empty",4,null,"n/a",null,null,"HTAE (T)Construction Materials",null,null,1.3516999999999999,1.577]
[null,"HTAF (L)","Laden","Coal ESI",null,null,97.682299999999998,null,4,2062,"NACO_loaded",4,null,"n/a",null,null,"HTAF (L)Coal ESI",null,null,3.5200999999999998,5.8855000000000004]
[null,"HTAF (T)","Unladen","Coal ESI",null,null,27,null,4,2062,"NACO_empty",4,null,"n/a",null,null,"HTAF (T)Coal ESI",null,null,1.3022,1.4307000000000001]
[null,"HTAF (L)","Laden","Coal Other",null,null,97.682299999999998,null,4,2062,"NACO_loaded",4,null,"n/a",null,null,"HTAF (L)Coal Other",null,null,3.6320999999999999,5.9333999999999998]
[null,"HTAF (T)","Unladen","Coal Other",null,null,27,null,4,2062,"NACO_empty",4,null,"n/a",null,null,"HTAF (T)Coal Other",null,null,1.3121,1.4599]
[null,"HTAF (L)","Laden","Construction Materials",null,null,97.682299999999998,null,4,2062,"NACO_loaded",4,null,"n/a",null,null,"HTAF (L)Construction Materials",null,null,3.6903000000000001,6.133]
[null,"HTAF (T)","Unladen","Construction Materials",null,null,27,null,4,2062,"NACO_empty",4,null,"n/a",null,null,"HTAF (T)Construction Materials",null,null,1.3516999999999999,1.577]
[null,"HXAA (L)","Laden","Coal ESI",null,null,96.439743816853635,null,4,1445,"Y25_loaded",6,null,"n/a",null,null,"HXAA (L)Coal ESI",null,null,2.7174999999999998,4.4808000000000003]
[null,"HXAA (T)","Unladen","Coal ESI",null,null,27,null,4,1445,"Y25_empty",6,null,"n/a",null,null,"HXAA (T)Coal ESI",null,null,1.0273000000000001,1.0925]
[null,"HXAA (L)","Laden","Coal Other",null,null,96.399878229750314,null,4,1445,"Y25_loaded",6,null,"n/a",null,null,"HXAA (L)Coal Other",null,null,2.8220999999999998,4.5191999999999997]
[null,"HXAA (T)","Unladen","Coal Other",null,null,27,null,4,1445,"Y25_empty",6,null,"n/a",null,null,"HXAA (T)Coal Other",null,null,1.0327999999999999,1.1085]
[null,"HXAA (T)","Unladen","Construction Materials",null,null,27,null,4,1445,"Y25_empty",6,null,"n/a",null,null,"HXAA (T)Construction Materials",null,null,1.0542,1.1722999999999999]
[null,"HXAA (T)","Unladen","Other",null,null,27,null,4,1445,"Y25_empty",6,null,"n/a",null,null,"HXAA (T)Other",null,null,1.0327,1.1085]
[null,"HXAB (L)","Laden","Coal ESI",null,null,96.519222704416251,null,4,1445,"Y25_loaded",6,null,"n/a",null,null,"HXAB (L)Coal ESI",null,null,2.7229999999999999,4.4893999999999998]
[null,"HXAB (T)","Unladen","Coal ESI",null,null,27,null,4,1445,"Y25_empty",6,null,"n/a",null,null,"HXAB (T)Coal ESI",null,null,1.0317000000000001,1.0925]
[null,"HXAB (L)","Laden","Coal Other",null,null,96.401784678728831,null,4,1445,"Y25_loaded",6,null,"n/a",null,null,"HXAB (L)Coal Other",null,null,2.8296000000000001,4.5194000000000001]
[null,"HXAB (T)","Unladen","Coal Other",null,null,27,null,4,1445,"Y25_empty",6,null,"n/a",null,null,"HXAB (T)Coal Other",null,null,1.0369999999999999,1.1085]
[null,"HXAB (T)","Unladen","Construction Materials",null,null,27,null,4,1445,"Y25_empty",6,null,"n/a",null,null,"HXAB (T)Construction Materials",null,null,1.0585,1.1722999999999999]
[null,"HXAB (T)","Unladen","Other",null,null,27,null,4,1445,"Y25_empty",6,null,"n/a",null,null,"HXAB (T)Other",null,null,1.0369999999999999,1.1085]
[null,"HYAA (L)","Laden","Biomass",null,null,96.032142588244966,null,4,1330,"LN25_Loaded","n/a",null,0.86099999999999999,null,null,"HYAA (L)Biomass",null,null,2.8599000000000001,4.7267000000000001]
[null,"HYAA (T)","Unladen","Biomass",null,null,27,null,4,1330,"LN25_Empty","n/a",null,0.93,null,null,"HYAA (T)Biomass",null,null,1.0729,1.2041999999999999]
[null,"HYAA (L)","Laden","Coal ESI",null,null,101.02293405075126,null,4,1330,"LN25_Loaded","n/a",null,0.86799999999999999,null,null,"HYAA (L)Coal ESI",null,null,2.8250000000000002,4.8583999999999996]
[null,"HYAA (T)","Unladen","Coal ESI",null,null,27,null,4,1330,"LN25_Empty","n/a",null,0.92900000000000005,null,null,"HYAA (T)Coal ESI",null,null,1.0243,1.0595000000000001]
[null,"HYAA (L)","Laden","Coal other",null,null,101.735,null,4,1330,"LN25_Loaded","n/a",null,0.86799999999999999,null,null,"HYAA (L)Coal other",null,null,2.9384000000000001,4.9919000000000002]
[null,"HYAA (T)","Unladen","Coal other",null,null,27,null,4,1330,"LN25_Empty","n/a",null,0.92900000000000005,null,null,"HYAA (T)Coal other",null,null,1.0463,1.0738000000000001]
[null,"HYAA (L)","Laden","Construction Materials",null,null,101.73452157409295,null,4,1330,"LN25_Loaded","n/a",null,0.86799999999999999,null,null,"HYAA (L)Construction Materials",null,null,3.0228000000000002,5.1951999999999998]
[null,"HYAA (T)","Unladen","Construction Materials",null,null,27,null,4,1330,"LN25_Empty","n/a",null,0.92900000000000005,null,null,"HYAA (T)Construction Materials",null,null,1.0483,1.1312]
[null,"HYAA (L)","Laden","Industrial Minerals",null,null,101.735,null,4,1330,"LN25_Loaded","n/a",null,0.86799999999999999,null,null,"HYAA (L)Industrial Minerals",null,null,2.8471000000000002,4.6733000000000002]
[null,"HYAA (T)","Unladen","Industrial Minerals",null,null,27,null,4,1330,"LN25_Empty","n/a",null,0.92900000000000005,null,null,"HYAA (T)Industrial Minerals",null,null,1.0126999999999999,0.97399999999999998]
[null,"HYAA (T)","Unladen","Other",null,null,27,null,4,1330,"LN25_Empty","n/a",null,0.92900000000000005,null,null,"HYAA (T)Other",null,null,1.0290999999999999,1.0738000000000001]
[null,"HYAA (L)","Laden","Steel",null,null,101.93695682348358,null,4,1330,"LN25_Loaded","n/a",null,0.86799999999999999,null,null,"HYAA (L)Steel",null,null,2.9727999999999999,5.0164999999999997]
[null,"HYAA (T)","Unladen","Steel",null,null,27,null,4,1330,"LN25_Empty","n/a",null,0.92900000000000005,null,null,"HYAA (T)Steel",null,null,1.0289999999999999,1.0738000000000001]
[null,"HYAB (L)","Laden","Coal ESI",null,null,99.77,null,4,1330,"LN25_Loaded",6,null,"n/a",null,null,"HYAB (L)Coal ESI",null,null,2.794,4.8470000000000004]
[null,"HYAB (T)","Unladen","Coal ESI",null,null,24,null,4,1330,"LN25_Empty",6,null,"n/a",null,null,"HYAB (T)Coal ESI",null,null,1.0002,1.0111000000000001]
[null,"HYAB (L)","Laden","Construction Materials",null,null,99.77,null,4,1330,"LN25_Loaded",6,null,"n/a",null,null,"HYAB (L)Construction Materials",null,null,2.9561000000000002,5.0865]
[null,"HYAB (T)","Unladen","Construction Materials",null,null,24,null,4,1330,"LN25_Empty",6,null,"n/a",null,null,"HYAB (T)Construction Materials",null,null,1.026,1.0873999999999999]
[null,"HYAB (L)","Laden","Industrial Minerals",null,null,99.77,null,4,1330,"LN25_Loaded",6,null,"n/a",null,null,"HYAB (L)Industrial Minerals",null,null,2.8138000000000001,4.5900999999999996]
[null,"HYAB (T)","Unladen","Industrial Minerals",null,null,24,null,4,1330,"LN25_Empty",6,null,"n/a",null,null,"HYAB (T)Industrial Minerals",null,null,0.96940000000000004,0.92]
[null,"ICAD (T)","Unladen","Construction Materials",null,null,21,null,4,1344,"Y25_empty","n/a",null,0.85599999999999998,null,null,"ICAD (T)Construction Materials",null,null,1.0607,1.1166]
[null,"ICAD (L)","Laden","Enterprise",null,null,74.606870534368056,null,4,1344,"Y25_loaded","n/a",null,0.89300000000000002,null,null,"ICAD (L)Enterprise",null,null,2.2938000000000001,2.7541000000000002]
[null,"ICAD (T)","Unladen","Enterprise",null,null,21,null,4,1344,"Y25_empty","n/a",null,0.85599999999999998,null,null,"ICAD (T)Enterprise",null,null,1.1200000000000001,1.0831999999999999]
[null,"ICAD (L)","Laden","European Conventional",null,null,87.461123343068962,null,4,1344,"Y25_loaded","n/a",null,0.89300000000000002,null,null,"ICAD (L)European Conventional",null,null,2.6160000000000001,3.8426999999999998]
[null,"ICAD (T)","Unladen","European Conventional",null,null,21,null,4,1344,"Y25_empty","n/a",null,0.85599999999999998,null,null,"ICAD (T)European Conventional",null,null,1.1426000000000001,1.1499999999999999]
[null,"ICAD (L)","Laden","Industrial Minerals",null,null,88.95,null,4,1344,"Y25_loaded","n/a",null,0.89300000000000002,null,null,"ICAD (L)Industrial Minerals"]
[null,"ICAD (T)","Unladen","Industrial Minerals",null,null,21.4,null,4,1344,"Y25_empty","n/a",null,0.85599999999999998,null,null,"ICAD (T)Industrial Minerals"]
[null,"ICAD (L)","Laden","Other",null,null,50.984979883772915,null,4,1344,"Y25_loaded","n/a",null,0.89300000000000002,null,null,"ICAD (L)Other",null,null,1.8542000000000001,1.6991000000000001]
[null,"ICAD (T)","Unladen","Other",null,null,21,null,4,1344,"Y25_empty","n/a",null,0.85599999999999998,null,null,"ICAD (T)Other",null,null,1.0419,1.0499000000000001]
[null,"ICAG (L)","Laden","Other",null,null,28,null,4,1332,"Y25_loaded","n/a",null,0.89300000000000002,null,null,"ICAG (L)Other",null,null,1.2025999999999999,1.3673]
[null,"ICAG (L)","Laden","Petroleum",null,null,63.341993904370256,null,4,1332,"Y25_loaded","n/a",null,0.89300000000000002,null,null,"ICAG (L)Petroleum",null,null,1.4410000000000001,2.0992000000000002]
[null,"ICAG (T)","Unladen","Petroleum",null,null,28,null,4,1332,"Y25_empty","n/a",null,0.85599999999999998,null,null,"ICAG (T)Petroleum",null,null,1.0067999999999999,1.0432999999999999]
[null,"IDAP (L)","Laden","Domestic Intermodal",null,null,114,null,8,956,"Y25_loaded",6,null,"n/a",null,null,"IDAP (L)Domestic Intermodal",null,null,1.5045999999999999,1.8194999999999999]
[null,"IDAP (T)","Unladen","Domestic Intermodal",null,null,36.56,null,8,956,"Y25_empty",6,null,"n/a",null,null,"IDAP (T)Domestic Intermodal",null,null,0.92279999999999995,0.84770000000000001]
[null,"IDAP (T)","Unladen","Other",null,null,36.56,null,8,956,"Y25_empty",6,null,"n/a",null,null,"IDAP (T)Other",null,null,0.86140000000000005,0.77039999999999997]
[null,"IDAQ (L)","Laden","Domestic Intermodal",null,null,75.61,null,8,956,"Y25_Loaded",6,null,"n/a",null,null,"IDAQ (L)Domestic Intermodal",null,null,1.1893,1.2382]
[null,"IDAQ (T)","Unladen","Domestic Intermodal",null,null,36.56,null,8,956,"Y25_Empty",6,null,"n/a",null,null,"IDAQ (T)Domestic Intermodal",null,null,0.92279999999999995,0.84770000000000001]
[null,"IFAB (L)","Laden","European Automotive",null,null,30.413417056368484,null,2,1371,"2axle_loaded",4,null,"n/a",null,null,"IFAB (L)European Automotive",null,null,2.3308,2.7004999999999999]
[null,"IFAB (L)","Laden","European Conventional",null,null,31.4,null,2,1371,"2axle_loaded",4,null,"n/a",null,null,"IFAB (L)European Conventional",null,null,2.2185000000000001,2.7856999999999998]
[null,"IFAB (L)","Laden","European Intermodal",null,null,30.76028286910088,null,2,1371,"2axle_loaded",4,null,"n/a",null,null,"IFAB (L)European Intermodal",null,null,2.3786999999999998,2.8759000000000001]
[null,"IFAD (L)","Laden","Domestic Automotive",null,null,36,null,4,1292,"Y25_loaded",5,null,"n/a",null,null,"IFAD (L)Domestic Automotive"]
[null,"IFAD (T)","Unladen","Domestic Automotive",null,null,18.2,null,4,1292,"Y25_empty",5,null,"n/a",null,null,"IFAD (T)Domestic Automotive"]
[null,"IFAD (L)","Laden","Domestic Intermodal",null,null,36,null,4,1292,"Y25_loaded",5,null,"n/a",null,null,"IFAD (L)Domestic Intermodal"]
[null,"IFAD (T)","Unladen","Domestic Intermodal",null,null,18.2,null,4,1292,"Y25_empty",5,null,"n/a",null,null,"IFAD (T)Domestic Intermodal"]
[null,"IFAD (L)","Laden","European Automotive",null,null,36,null,4,1292,"Y25_loaded",5,null,"n/a",null,null,"IFAD (L)European Automotive"]
[null,"IFAD (T)","Unladen","European Automotive",null,null,18.2,null,4,1292,"Y25_empty",5,null,"n/a",null,null,"IFAD (T)European Automotive"]
[null,"IFAD (L)","Laden","European Intermodal",null,null,36,null,4,1292,"Y25_loaded",5,null,"n/a",null,null,"IFAD (L)European Intermodal"]
[null,"IFAD (T)","Unladen","European Intermodal",null,null,18.2,null,4,1292,"Y25_empty",5,null,"n/a",null,null,"IFAD (T)European Intermodal"]
[null,"IFAE (L)","Laden","Construction Materials",null,null,90.8888888888889,null,8,1292,"Y25_loaded",5,null,"n/a",null,null,"IFAE (L)Construction Materials",null,null,1.4621999999999999,1.4765999999999999]
[null,"IFAE (L)","Laden","Domestic Automotive",null,null,73.47,null,8,1292,"Y25_Loaded",5,null,"n/a",null,null,"IFAE (L)Domestic Automotive",null,null,1.1493,1.2287999999999999]
[null,"IFAE (T)","Unladen","Domestic Automotive",null,null,36.549999999999997,null,8,1292,"Y25_Empty",5,null,"n/a",null,null,"IFAE (T)Domestic Automotive",null,null,0.9677,0.84899999999999998]
[null,"IFAE (L)","Laden","Domestic Intermodal",null,null,91.244992999330364,null,8,1292,"Y25_loaded",5,null,"n/a",null,null,"IFAE (L)Domestic Intermodal",null,null,1.7634000000000001,1.5305]
[null,"IFAE (T)","Unladen","Domestic Intermodal",null,null,36.554774458113648,null,8,1292,"Y25_empty",5,null,"n/a",null,null,"IFAE (T)Domestic Intermodal",null,null,1.0019,1.0036]
[null,"IFAE (L)","Laden","Enterprise",null,null,49.221384565499356,null,8,1292,"Y25_loaded",5,null,"n/a",null,null,"IFAE (L)Enterprise",null,null,1.4845999999999999,1.0968]
[null,"IFAE (T)","Unladen","Enterprise",null,null,37,null,8,1292,"Y25_empty",5,null,"n/a",null,null,"IFAE (T)Enterprise",null,null,0.98150000000000004,0.88890000000000002]
[null,"IFAE (L)","Laden","European Conventional",null,null,55.884035127223598,null,8,1292,"Y25_loaded",5,null,"n/a",null,null,"IFAE (L)European Conventional",null,null,1.4762999999999999,1.1775]
[null,"IFAE (T)","Unladen","European Conventional",null,null,37,null,8,1292,"Y25_empty",5,null,"n/a",null,null,"IFAE (T)European Conventional",null,null,1.0017,0.96530000000000005]
[null,"IFAE (L)","Laden","European Intermodal",null,null,44.97,null,8,1292,"Y25_Loaded",5,null,"n/a",null,null,"IFAE (L)European Intermodal",null,null,1.2949999999999999,1.2639]
[null,"IFAE (T)","Unladen","European Intermodal",null,null,36.549999999999997,null,8,1292,"Y25_Empty",5,null,"n/a",null,null,"IFAE (T)European Intermodal",null,null,1.0528999999999999,1.1003000000000001]
[null,"IFAE (L)","Laden","Steel",null,null,125.641376251894,null,8,1292,"Y25_loaded",5,null,"n/a",null,null,"IFAE (L)Steel",null,null,1.8277000000000001,2.0564]
[null,"IFAE (T)","Unladen","Steel",null,null,37,null,8,1292,"Y25_empty",5,null,"n/a",null,null,"IFAE (T)Steel",null,null,0.91930000000000001,0.85070000000000001]
[null,"IFAG (L)","Laden","Domestic Automotive",null,null,60.566015145313145,null,4,1371,"NACO_loaded",4,null,"n/a",null,null,"IFAG (L)Domestic Automotive",null,null,2.6711,3.6408]
[null,"IFAG (T)","Unladen","Domestic Automotive",null,null,46,null,4,1371,"NACO_empty",4,null,"n/a",null,null,"IFAG (T)Domestic Automotive",null,null,1.4597,1.647]
[null,"IFAG (L)","Laden","Enterprise",null,null,59.643352082823831,null,4,1371,"NACO_loaded",4,null,"n/a",null,null,"IFAG (L)Enterprise",null,null,2.5981000000000001,3.6570999999999998]
[null,"IFAG (T)","Unladen","Enterprise",null,null,46,null,4,1371,"NACO_empty",4,null,"n/a",null,null,"IFAG (T)Enterprise",null,null,1.5008999999999999,1.6732]
[null,"IFAG (L)","Laden","Other",null,null,59.059055628623824,null,4,1371,"NACO_loaded",4,null,"n/a",null,null,"IFAG (L)Other",null,null,2.4885000000000002,3.6156999999999999]
[null,"IFAG (T)","Unladen","Other",null,null,46,null,4,1371,"NACO_empty",4,null,"n/a",null,null,"IFAG (T)Other",null,null,1.3922000000000001,1.647]
[null,"IFAM (L)","Laden","Domestic Intermodal",null,null,60,null,8,1292,"Y25_loaded",5,null,"n/a",null,null,"IFAM (L)Domestic Intermodal"]
[null,"IFAM (T)","Unladen","Domestic Intermodal",null,null,36.554499999999997,null,8,1292,"Y25_Empty",5,null,"n/a",null,null,"IFAM (T)Domestic Intermodal"]
[null,"IFAM (L)","Laden","Other",null,null,60,null,8,1292,"Y25_loaded",5,null,"n/a",null,null,"IFAM (L)Other"]
[null,"IFAM (T)","Unladen","Other",null,null,36.554499999999997,null,8,1292,"Y25_Empty",5,null,"n/a",null,null,"IFAM (T)Other"]
[null,"IFBB (L)","Laden","Domestic Automotive",null,null,32.130434782608695,null,2,1371,"2axle_loaded",2,null,"n/a","Retain. Potential future use. GBRf",null,"IFBB (L)Domestic Automotive",null,null,2.3772000000000002,2.8818999999999999]
[null,"IFBB (L)","Laden","European Automotive",null,null,30.283156203564719,null,2,1371,"2axle_loaded",2,null,"n/a",null,null,"IFBB (L)European Automotive",null,null,2.3754,2.8347000000000002]
[null,"IFBB (L)","Laden","European Conventional",null,null,32.443680794196261,null,2,1371,"2axle_loaded",2,null,"n/a",null,null,"IFBB (L)European Conventional",null,null,2.2850000000000001,3.0430000000000001]
[null,"IFBB (L)","Laden","European Intermodal",null,null,30.917173738991195,null,2,1371,"2axle_loaded",2,null,"n/a",null,null,"IFBB (L)European Intermodal",null,null,2.4342999999999999,3.0434000000000001]
[null,"IFBB (T)","Unladen","European Intermodal",null,null,20.674304418985272,null,2,1371,"2axle_empty",2,null,"n/a",null,null,"IFBB (T)European Intermodal",null,null,1.3309,1.8478000000000001]
[null,"IFBB (T)","Unladen","Other",null,null,22,null,2,1371,"2axle_empty",2,null,"n/a","Retain. Potential future use. GBRf",null,"IFBB (T)Other",null,null,1.244,1.7209000000000001]
[null,"IGAD (L)","Laden","Construction Materials",null,null,56,null,4,1202,"NACO_loaded",4,null,"n/a",null,null,"IGAD (L)Construction Materials",null,null,2.8826000000000001,3.6246999999999998]
[null,"IGAD (L)","Laden","European Intermodal",null,null,70.64595494443725,null,4,1202,"NACO_loaded",4,null,"n/a",null,null,"IGAD (L)European Intermodal",null,null,3.2948,4.2089999999999996]
[null,"IGAD (T)","Unladen","European Intermodal",null,null,24,null,4,1202,"NACO_empty",4,null,"n/a",null,null,"IGAD (T)European Intermodal",null,null,1.349,1.5418000000000001]
[null,"IGAD (L)","Laden","Steel",null,null,66.394888358376633,null,4,1202,"NACO_loaded",4,null,"n/a",null,null,"IGAD (L)Steel",null,null,2.9365000000000001,3.7761]
[null,"IGAD (T)","Unladen","Steel",null,null,24,null,4,1202,"NACO_empty",4,null,"n/a",null,null,"IGAD (T)Steel",null,null,1.2404999999999999,1.3621000000000001]
[null,"IHAF (L)","Laden","Construction Materials",null,null,82.15789473684211,null,4,1344,"Y25_loaded",5,null,"n/a",null,null,"IHAF (L)Construction Materials",null,null,2.3149999999999999,3.4617]
[null,"IHAF (T)","Unladen","Construction Materials",null,null,23.49905381964,null,4,1344,"Y25_empty",5,null,"n/a",null,null,"IHAF (T)Construction Materials",null,null,1.0510999999999999,1.1757]
[null,"IHAF (T)","Unladen","Domestic Intermodal",null,null,22,null,4,1344,"Y25_empty",5,null,"n/a",null,null,"IHAF (T)Domestic Intermodal",null,null,1.1233,1.2464999999999999]
[null,"IHAF (L)","Laden","Enterprise",null,null,87,null,4,1344,"Y25_loaded",5,null,"n/a",null,null,"IHAF (L)Enterprise",null,null,2.5621,3.8092000000000001]
[null,"IHAF (T)","Unladen","Enterprise",null,null,22.727793040293044,null,4,1344,"Y25_empty",5,null,"n/a",null,null,"IHAF (T)Enterprise",null,null,1.1026,1.1415999999999999]
[null,"IHAF (T)","Unladen","European Conventional",null,null,23.666666666666668,null,4,1344,"Y25_empty",5,null,"n/a",null,null,"IHAF (T)European Conventional",null,null,1.1241000000000001,1.2088000000000001]
[null,"IHAF (L)","Laden","European Intermodal",null,null,82.405872785471473,null,4,1344,"Y25_loaded",5,null,"n/a",null,null,"IHAF (L)European Intermodal",null,null,2.6941999999999999,3.7766000000000002]
[null,"IHAF (T)","Unladen","European Intermodal",null,null,23.417645313096198,null,4,1344,"Y25_empty",5,null,"n/a",null,null,"IHAF (T)European Intermodal",null,null,1.143,1.3251999999999999]
[null,"IHAF (L)","Laden","Industrial Minerals",null,null,76.497960056900723,null,4,1344,"Y25_loaded",5,null,"n/a",null,null,"IHAF (L)Industrial Minerals",null,null,2.1002999999999998,2.7795000000000001]
[null,"IHAF (T)","Unladen","Industrial Minerals",null,null,22.638835613181381,null,4,1344,"Y25_empty",5,null,"n/a",null,null,"IHAF (T)Industrial Minerals",null,null,0.99280000000000002,0.98860000000000003]
[null,"IHAF (L)","Laden","Other",null,null,73,null,4,1344,"Y25_loaded",5,null,"n/a",null,null,"IHAF (L)Other",null,null,2.0693999999999999,2.7195999999999998]
[null,"IHAF (T)","Unladen","Other",null,null,22.65783930183569,null,4,1344,"Y25_empty",5,null,"n/a",null,null,"IHAF (T)Other",null,null,1.0233000000000001,1.1074999999999999]
[null,"IHAF (L)","Laden","Steel",null,null,81.739678778780586,null,4,1344,"Y25_loaded",5,null,"n/a",null,null,"IHAF (L)Steel",null,null,2.2692000000000001,3.3113000000000001]
[null,"IHAF (T)","Unladen","Steel",null,null,22.758738214024728,null,4,1344,"Y25_empty",5,null,"n/a",null,null,"IHAF (T)Steel",null,null,1.0319,1.1076999999999999]
[null,"IHAG (L)","Laden","Steel",null,null,79.322269921792085,null,4,1344,"Y25_loaded",5,null,"n/a",null,null,"IHAG (L)Steel",null,null,2.25,3.133]
[null,"IHAG (T)","Unladen","Steel",null,null,21,null,4,1344,"Y25_empty",5,null,"n/a",null,null,"IHAG (T)Steel",null,null,1.0543,1.1066]
[null,"IIAA (L)","Laden","Biomass",null,null,96.737217374988262,null,4,1310,"LN25_loaded",6,null,"n/a","No change to VCs (NP 6.10.23)",null,"IIAA (L)Biomass",null,null,2.9916999999999998,4.9625000000000004]
[null,"IIAA (T)","Unladen","Biomass",null,null,27,null,4,1310,"LN25_Empty",6,null,"n/a","No change to VCs (NP 6.10.23)",null,"IIAA (T)Biomass",null,null,1.0722,1.1686000000000001]
[null,"IIAA (L)","Laden","Coal ESI",null,null,100.98208051800654,null,4,1310,"LN25_loaded",6,null,"n/a","No change to VCs (NP 6.10.23)",null,"IIAA (L)Coal ESI",null,null,2.9296000000000002,4.9913999999999996]
[null,"IIAA (T)","Unladen","Coal ESI",null,null,27,null,4,1310,"LN25_Empty",6,null,"n/a","No change to VCs (NP 6.10.23)",null,"IIAA (T)Coal ESI",null,null,1.0246,1.0328999999999999]
[null,"IIAA (L)","Laden","Coal other",null,null,102,null,4,1310,"LN25_loaded",6,null,"n/a","No change to VCs (NP 6.10.23)",null,"IIAA (L)Coal other",null,null,3.1305000000000001,5.1656000000000004]
[null,"IIAA (T)","Unladen","Coal other",null,null,27,null,4,1310,"LN25_Empty",6,null,"n/a","No change to VCs (NP 6.10.23)",null,"IIAA (T)Coal other",null,null,1.0513999999999999,1.0464]
[null,"IIAA (L)","Laden","Construction Materials",null,null,101.91377879757542,null,4,1310,"LN25_loaded",6,null,"n/a","No change to VCs (NP 6.10.23)",null,"IIAA (L)Construction Materials",null,null,3.1387,5.3592000000000004]
[null,"IIAA (T)","Unladen","Construction Materials",null,null,27,null,4,1310,"LN25_Empty",6,null,"n/a","No change to VCs (NP 6.10.23)",null,"IIAA (T)Construction Materials",null,null,1.0484,1.1006]
[null,"IIAA (L)","Laden","Industrial Minerals",null,null,102,null,4,1310,"LN25_loaded",6,null,"n/a","No change to VCs (NP 6.10.23)",null,"IIAA (L)Industrial Minerals",null,null,3.0381999999999998,4.8445999999999998]
[null,"IIAA (T)","Unladen","Industrial Minerals",null,null,27,null,4,1310,"LN25_Empty",6,null,"n/a","No change to VCs (NP 6.10.23)",null,"IIAA (T)Industrial Minerals",null,null,1.0184,0.95230000000000004]
[null,"IIAA (L)","Laden","Other",null,null,98.721439749608777,null,4,1310,"LN25_loaded",6,null,"n/a","No change to VCs (NP 6.10.23)",null,"IIAA (L)Other",null,null,2.9483000000000001,4.7695999999999996]
[null,"IIAA (T)","Unladen","Other",null,null,27,null,4,1310,"LN25_Empty",6,null,"n/a","No change to VCs (NP 6.10.23)",null,"IIAA (T)Other",null,null,1.0294000000000001,1.0464]
[null,"IIAB (L)","Laden","Construction Materials",null,null,97.701270858647021,null,4,1330,"LN25_loaded","n/a",null,0.86799999999999999,"No change to VCs (NP 6.10.23)",null,"IIAB (L)Construction Materials",null,null,2.9121999999999999,4.7084000000000001]
[null,"IIAB (T)","Unladen","Construction Materials",null,null,24,null,4,1330,"LN25_empty","n/a",null,0.90600000000000003,"No change to VCs (NP 6.10.23)",null,"IIAB (T)Construction Materials",null,null,1.0530999999999999,1.0939000000000001]
[null,"IIAB (L)","Laden","Enterprise",null,null,95,null,4,1330,"LN25_loaded","n/a",null,0.86799999999999999,"No change to VCs (NP 6.10.23)",null,"IIAB (L)Enterprise",null,null,2.9586999999999999,4.3236999999999997]
[null,"IIAB (T)","Unladen","Enterprise",null,null,24,null,4,1330,"LN25_empty","n/a",null,0.90600000000000003,"No change to VCs (NP 6.10.23)",null,"IIAB (T)Enterprise",null,null,1.1099000000000001,1.0630999999999999]
[null,"IIAB (T)","Unladen","Other",null,null,24,null,4,1330,"LN25_empty","n/a",null,0.90600000000000003,"No change to VCs (NP 6.10.23)",null,"IIAB (T)Other",null,null,1.0323,1.0324]
[null,"IIAC (L)","Laden","Biomass",null,null,81.462458284450889,null,4,1330,"LN25_Loaded","n/a",null,0.86799999999999999,null,null,"IIAC (L)Biomass",null,null,2.0874000000000001,3.3488000000000002]
[null,"IIAC (T)","Unladen","Biomass",null,null,27.002541350576081,null,4,1330,"LN25_Empty","n/a",null,0.90600000000000003,null,null,"IIAC (T)Biomass",null,null,1.0685,1.1816]
[null,"IIAC (L)","Laden","Coal ESI",null,null,81.472134935304993,null,4,1330,"LN25_Loaded","n/a",null,0.86799999999999999,null,null,"IIAC (L)Coal ESI",null,null,1.9701,3.0548000000000002]
[null,"IIAC (T)","Unladen","Coal ESI",null,null,27.000747763545043,null,4,1330,"LN25_Empty","n/a",null,0.90600000000000003,null,null,"IIAC (T)Coal ESI",null,null,1.0179,1.0410999999999999]
[null,"IIAC (L)","Laden","Coal Other",null,null,98,null,4,1330,"LN25_Loaded","n/a",null,0.86799999999999999,null,null,"IIAC (L)Coal Other"]
[null,"IIAC (T)","Unladen","Coal Other",null,null,27.000699999999998,null,4,1330,"LN25_Empty","n/a",null,0.90600000000000003,null,null,"IIAC (T)Coal Other"]
[null,"IIAC (L)","Laden","Construction Materials",null,null,97.2,null,4,1330,"LN25_Loaded","n/a",null,0.86799999999999999,null,null,"IIAC (L)Construction Materials",null,null,2.8304779999999998,4.6513999999999998]
[null,"IIAC (T)","Unladen","Construction Materials",null,null,27,null,4,1330,"LN25_Empty","n/a",null,0.90600000000000003,null,null,"IIAC (T)Construction Materials",null,null,1.0415000000000001,1.1111]
[null,"IIAC (T)","Unladen","Industrial Minerals",null,null,27.000699999999998,null,4,1330,"LN25_Empty","n/a",null,0.90600000000000003,null,null,"IIAC (T)Industrial Minerals"]
[null,"IIAC (T)","Unladen","Other",null,null,27,null,4,1330,"LN25_Empty","n/a",null,0.90600000000000003,null,null,"IIAC (T)Other",null,null,1.0271931999999999,1.0550999999999999]
[null,"IIAD (L)","Laden","Biomass",null,null,94.7,null,4,1330,"LN25_Loaded",6,null,"n/a",null,null,"IIAD (L)Biomass",null,null,2.7444000000000002,4.7230999999999996]
[null,"IIAD (T)","Unladen","Biomass",null,null,29.25,null,4,1330,"LN25_Empty",6,null,"n/a",null,null,"IIAD (T)Biomass",null,null,1.0760000000000001,1.1903999999999999]
[null,"IIAD (L)","Laden","Coal ESI",null,null,94.7,null,4,1330,"LN25_Loaded",6,null,"n/a",null,null,"IIAD (L)Coal ESI",null,null,2.5356000000000001,4.2887000000000004]
[null,"IIAD (T)","Unladen","Coal ESI",null,null,29.25,null,4,1330,"LN25_Empty",6,null,"n/a",null,null,"IIAD (T)Coal ESI",null,null,1.0319,1.0586]
[null,"IIAF (L)","Laden","Industrial Minerals",null,null,86.38,null,4,1330,"LN25_Loaded",6,null,"n/a",null,null,"IIAF (L)Industrial Minerals",null,null,2.1966000000000001,3.3426999999999998]
[null,"IIAF (T)","Unladen","Industrial Minerals",null,null,25,null,4,1330,"LN25_Empty",6,null,"n/a",null,null,"IIAF (T)Industrial Minerals",null,null,0.97489999999999999,0.92979999999999996]
[null,"IKAF (L)","Laden","Construction Materials",null,null,51,null,8,1077,"Y25_loaded",5,null,"n/a",null,null,"IKAF (L)Construction Materials",null,null,1.228,1.0888]
[null,"IKAF (T)","Unladen","Construction Materials",null,null,41,null,8,1077,"Y25_empty",5,null,"n/a",null,null,"IKAF (T)Construction Materials",null,null,0.93140000000000001,0.88449999999999995]
[null,"IKAF (L)","Laden","Domestic Intermodal",null,null,78.544824024124281,null,8,1077,"Y25_loaded",5,null,"n/a",null,null,"IKAF (L)Domestic Intermodal",null,null,1.5383,1.3349]
[null,"IKAF (T)","Unladen","Domestic Intermodal",null,null,41,null,8,1077,"Y25_empty",5,null,"n/a",null,null,"IKAF (T)Domestic Intermodal",null,null,0.98799999999999999,0.93300000000000005]
[null,"IKAF (L)","Laden","Enterprise",null,null,53,null,8,1077,"Y25_loaded",5,null,"n/a",null,null,"IKAF (L)Enterprise",null,null,1.3007,1.0774999999999999]
[null,"IKAF (T)","Unladen","Enterprise",null,null,41,null,8,1077,"Y25_empty",5,null,"n/a",null,null,"IKAF (T)Enterprise",null,null,0.98280000000000001,0.86029999999999995]
[null,"IKAF (L)","Laden","European Conventional",null,null,77.666666666666657,null,8,1077,"Y25_loaded",5,null,"n/a",null,null,"IKAF (L)European Conventional",null,null,1.5112000000000001,1.3070999999999999]
[null,"IKAF (L)","Laden","European Intermodal",null,null,89.479018834866409,null,8,1077,"Y25_loaded",5,null,"n/a",null,null,"IKAF (L)European Intermodal",null,null,1.6654,1.5221]
[null,"IKAF (T)","Unladen","European Intermodal",null,null,41,null,8,1077,"Y25_empty",5,null,"n/a",null,null,"IKAF (T)European Intermodal",null,null,1.0084,0.99370000000000003]
[null,"IKAF (L)","Laden","Other",null,null,50.864042933810374,null,8,1077,"Y25_loaded",5,null,"n/a",null,null,"IKAF (L)Other",null,null,1.3125,1.0475000000000001]
[null,"IKAF (T)","Unladen","Other",null,null,41,null,8,1077,"Y25_empty",5,null,"n/a",null,null,"IKAF (T)Other",null,null,0.91490000000000005,0.83620000000000005]
[null,"IKAH (L)","Laden","Domestic Intermodal",null,null,74.875025623423866,null,8,1077,"Y25_loaded",5,null,"n/a",null,null,"IKAH (L)Domestic Intermodal",null,null,1.5167999999999999,1.2958000000000001]
[null,"IKAH (T)","Unladen","Domestic Intermodal",null,null,39,null,8,1077,"Y25_empty",5,null,"n/a",null,null,"IKAH (T)Domestic Intermodal",null,null,0.9839,0.92649999999999999]
[null,"IKAH (L)","Laden","Enterprise",null,null,49.666666666666671,null,8,1077,"Y25_loaded",5,null,"n/a",null,null,"IKAH (L)Enterprise",null,null,1.3976999999999999,1.0630999999999999]
[null,"IKAH (T)","Unladen","Enterprise",null,null,39,null,8,1077,"Y25_empty",5,null,"n/a",null,null,"IKAH (T)Enterprise",null,null,0.97719999999999996,0.85060000000000002]
[null,"IKAH (L)","Laden","European Conventional",null,null,60.427662957074723,null,8,1077,"Y25_loaded",5,null,"n/a",null,null,"IKAH (L)European Conventional",null,null,1.4212,1.1574]
[null,"IKAH (T)","Unladen","European Conventional",null,null,39,null,8,1077,"Y25_empty",5,null,"n/a",null,null,"IKAH (T)European Conventional",null,null,0.99419999999999997,0.90110000000000001]
[null,"IKAH (L)","Laden","European Intermodal",null,null,70.756058666922172,null,8,1077,"Y25_loaded",5,null,"n/a",null,null,"IKAH (L)European Intermodal",null,null,1.5429999999999999,1.3015000000000001]
[null,"IKAH (T)","Unladen","European Intermodal",null,null,39,null,8,1077,"Y25_empty",5,null,"n/a",null,null,"IKAH (T)European Intermodal",null,null,1.0053000000000001,0.9899]
[null,"IKAH (L)","Laden","Other",null,null,50.32525252525253,null,8,1077,"Y25_loaded",5,null,"n/a",null,null,"IKAH (L)Other",null,null,1.3058000000000001,1.0451999999999999]
[null,"IKAH (T)","Unladen","Other",null,null,39,null,8,1077,"Y25_empty",5,null,"n/a",null,null,"IKAH (T)Other",null,null,0.91039999999999999,0.82530000000000003]
[null,"IKAH (T)","Unladen","Steel",null,null,39,null,8,1077,"Y25_empty",5,null,"n/a",null,null,"IKAH (T)Steel",null,null,0.91039999999999999,0.82530000000000003]
[null,"IKAJ (L)","Laden","Construction Materials",null,null,51,null,8,1077,"Y25_loaded",5,null,"n/a",null,null,"IKAJ (L)Construction Materials"]
[null,"IKAJ (T)","Unladen","Construction Materials",null,null,39.383299999999998,null,8,1077,"Y25_empty",5,null,"n/a",null,null,"IKAJ (T)Construction Materials"]
[null,"IKAJ (T)","Unladen","Domestic Automotive",null,null,39,null,8,1077,"Y25_empty",5,null,"n/a",null,null,"IKAJ (T)Domestic Automotive",null,null,0.99409999999999998,0.82530000000000003]
[null,"IKAJ (L)","Laden","Domestic Intermodal",null,null,76.507320929259024,null,8,1077,"Y25_loaded",5,null,"n/a",null,null,"IKAJ (L)Domestic Intermodal",null,null,1.1997,1.3128]
[null,"IKAJ (T)","Unladen","Domestic Intermodal",null,null,39.017300459456813,null,8,1077,"Y25_empty",5,null,"n/a",null,null,"IKAJ (T)Domestic Intermodal",null,null,1.0283,0.92649999999999999]
[null,"IKAJ (L)","Laden","Enterprise",null,null,55.074777687954729,null,8,1077,"Y25_loaded",5,null,"n/a",null,null,"IKAJ (L)Enterprise",null,null,1.0829,1.0880000000000001]
[null,"IKAJ (T)","Unladen","Enterprise",null,null,39,null,8,1077,"Y25_empty",5,null,"n/a",null,null,"IKAJ (T)Enterprise",null,null,1.0234000000000001,0.85060000000000002]
[null,"IKAJ (L)","Laden","European Conventional",null,null,79.58680628272252,null,8,1077,"Y25_loaded",5,null,"n/a",null,null,"IKAJ (L)European Conventional",null,null,1.2002999999999999,1.3284]
[null,"IKAJ (T)","Unladen","European Conventional",null,null,39,null,8,1077,"Y25_empty",5,null,"n/a",null,null,"IKAJ (T)European Conventional",null,null,1.0405,0.90110000000000001]
[null,"IKAJ (L)","Laden","European Intermodal",null,null,74.181409968567593,null,8,1077,"Y25_loaded",5,null,"n/a",null,null,"IKAJ (L)European Intermodal",null,null,1.2334000000000001,1.3344]
[null,"IKAJ (T)","Unladen","European Intermodal",null,null,39,null,8,1077,"Y25_empty",5,null,"n/a",null,null,"IKAJ (T)European Intermodal",null,null,1.0498000000000001,0.9899]
[null,"IKAJ (L)","Laden","Other",null,null,50.152964766542539,null,8,1077,"Y25_loaded",5,null,"n/a",null,null,"IKAJ (L)Other",null,null,1.0551999999999999,1.0444]
[null,"IKAJ (T)","Unladen","Other",null,null,39.383318544809235,null,8,1077,"Y25_empty",5,null,"n/a",null,null,"IKAJ (T)Other",null,null,0.9516,0.82730000000000004]
[null,"IKAJ (T)","Unladen","Steel",null,null,39,null,8,1077,"Y25_empty",5,null,"n/a",null,null,"IKAJ (T)Steel",null,null,0.91869999999999996,0.82530000000000003]
[null,"IKAK (L)","Laden","Domestic Intermodal",null,null,73.545845660749507,null,8,1077,"Y25_loaded",5,null,"n/a",null,null,"IKAK (L)Domestic Intermodal",null,null,1.5891999999999999,1.2825]
[null,"IKAK (T)","Unladen","Domestic Intermodal",null,null,39,null,8,1077,"Y25_empty",5,null,"n/a",null,null,"IKAK (T)Domestic Intermodal",null,null,1.0246,0.92649999999999999]
[null,"IKAK (L)","Laden","Other",null,null,51,null,8,1077,"Y25_loaded",5,null,"n/a","Retain. Potential future use. - GBRf",null,"IKAK (L)Other",null,null,1.3654999999999999,1.0482]
[null,"IKAK (T)","Unladen","Other",null,null,39,null,8,1077,"Y25_empty",5,null,"n/a","Retain. Potential future use. - GBRf",null,"IKAK (T)Other",null,null,0.94779999999999998,0.82530000000000003]
[null,"IOAE (L)","Laden","Construction Materials",null,null,98,null,4,1330,"LN25_loaded",6,null,"n/a",null,null,"IOAE (L)Construction Materials",null,null,2.8555000000000001,4.8718000000000004]
[null,"IOAE (T)","Unladen","Enterprise",null,null,24,null,4,1330,"LN25_empty",6,null,"n/a",null,null,"IOAE (T)Enterprise",null,null,1.0795999999999999,1.0569]
[null,"IPAA (L)","Laden","Domestic Automotive",null,null,30.366714641111663,null,4,1202,"NACO_loaded",4,null,"n/a",null,null,"IPAA (L)Domestic Automotive",null,null,3.1714000000000002,4.3640999999999996]
[null,"IPAA (T)","Unladen","Domestic Automotive",null,null,23.000889501541025,null,4,1202,"NACO_empty",4,null,"n/a",null,null,"IPAA (T)Domestic Automotive",null,null,1.3811,1.3674999999999999]
[null,"IPAA (L)","Laden","Enterprise",null,null,30.089480436177038,null,4,1202,"NACO_loaded",4,null,"n/a",null,null,"IPAA (L)Enterprise",null,null,3.141,4.4131999999999998]
[null,"IPAA (T)","Unladen","Enterprise",null,null,23,null,4,1202,"NACO_empty",4,null,"n/a",null,null,"IPAA (T)Enterprise",null,null,1.4171,1.3959999999999999]
[null,"IPAA (L)","Laden","Other",null,null,30.175824396998681,null,4,1202,"NACO_loaded",4,null,"n/a",null,null,"IPAA (L)Other",null,null,3.0501999999999998,4.3817000000000004]
[null,"IPAA (T)","Unladen","Other",null,null,23,null,4,1202,"NACO_empty",4,null,"n/a",null,null,"IPAA (T)Other",null,null,1.3262,1.3674999999999999]
[null,"IPAB (L)","Laden","Domestic Automotive",null,null,78.752992500059037,null,8,1202,"NACO_loaded",4,null,"n/a",null,null,"IPAB (L)Domestic Automotive",null,null,2.6240999999999999,2.4496000000000002]
[null,"IPAB (T)","Unladen","Domestic Automotive",null,null,60.000026349998237,null,8,1202,"NACO_empty",4,null,"n/a",null,null,"IPAB (T)Domestic Automotive",null,null,1.2444,1.1173999999999999]
[null,"IPAB (L)","Laden","Domestic Intermodal",null,null,78,null,8,1202,"NACO_loaded",4,null,"n/a",null,null,"IPAB (L)Domestic Intermodal",null,null,2.3761000000000001,2.5390000000000001]
[null,"IPAB (T)","Unladen","Domestic Intermodal",null,null,60,null,8,1202,"NACO_empty",4,null,"n/a",null,null,"IPAB (T)Domestic Intermodal",null,null,1.2758,1.2116]
[null,"IPAB (L)","Laden","Enterprise",null,null,77.986417059610105,null,8,1202,"NACO_loaded",4,null,"n/a",null,null,"IPAB (L)Enterprise",null,null,2.5445000000000002,2.4735999999999998]
[null,"IPAB (T)","Unladen","Enterprise",null,null,60,null,8,1202,"NACO_empty",4,null,"n/a",null,null,"IPAB (T)Enterprise",null,null,1.2794000000000001,1.1408]
[null,"IPAB (L)","Laden","Other",null,null,72.744334569427295,null,8,1202,"NACO_loaded",4,null,"n/a",null,null,"IPAB (L)Other",null,null,2.4706000000000001,2.4792000000000001]
[null,"IPAB (T)","Unladen","Other",null,null,60,null,8,1202,"NACO_empty",4,null,"n/a",null,null,"IPAB (T)Other",null,null,1.1883999999999999,1.1173999999999999]
[null,"IPAV (L)","Laden","Domestic Automotive",null,null,81.82723481444134,null,8,1202,"NACO_loaded",4,null,"n/a",null,null,"IPAV (L)Domestic Automotive",null,null,2.3489,2.4430000000000001]
[null,"IPAV (T)","Unladen","Domestic Automotive",null,null,56,null,8,1202,"NACO_empty",4,null,"n/a",null,null,"IPAV (T)Domestic Automotive",null,null,1.2263999999999999,1.0892999999999999]
[null,"IPAV (L)","Laden","Enterprise",null,null,83.388885200626717,null,8,1202,"NACO_loaded",4,null,"n/a",null,null,"IPAV (L)Enterprise",null,null,2.3100999999999998,2.4632000000000001]
[null,"IPAV (T)","Unladen","Enterprise",null,null,56,null,8,1202,"NACO_empty",4,null,"n/a",null,null,"IPAV (T)Enterprise",null,null,1.2607999999999999,1.1136999999999999]
[null,"IPAV (T)","Unladen","European Conventional",null,null,56,null,8,1202,"NACO_empty",4,null,"n/a",null,null,"IPAV (T)European Conventional",null,null,1.2771999999999999,1.1629]
[null,"IPAV (T)","Unladen","European Intermodal",null,null,56,null,8,1202,"NACO_empty",4,null,"n/a",null,null,"IPAV (T)European Intermodal",null,null,1.2801,1.2497]
[null,"IPAV (L)","Laden","Other",null,null,81.544271575157737,null,8,1202,"NACO_loaded",4,null,"n/a",null,null,"IPAV (L)Other",null,null,2.2355,2.4434]
[null,"IPAV (T)","Unladen","Other",null,null,56,null,8,1202,"NACO_empty",4,null,"n/a",null,null,"IPAV (T)Other",null,null,1.1724000000000001,1.0892999999999999]
[null,"IPAX (L)","Laden","Domestic Automotive",null,null,39.930553714260462,null,4,1202,"NACO_loaded",4,null,"n/a",null,null,"IPAX (L)Domestic Automotive",null,null,2.8209,3.7744]
[null,"IPAX (T)","Unladen","Domestic Automotive",null,null,27.006341240875912,null,4,1202,"NACO_empty",4,null,"n/a",null,null,"IPAX (T)Domestic Automotive",null,null,1.3169,1.3586]
[null,"IPAX (L)","Laden","Enterprise",null,null,41.147066673784231,null,4,1202,"NACO_loaded",4,null,"n/a",null,null,"IPAX (L)Enterprise",null,null,2.7770000000000001,3.7524999999999999]
[null,"IPAX (T)","Unladen","Enterprise",null,null,27.002715620247667,null,4,1202,"NACO_empty",4,null,"n/a",null,null,"IPAX (T)Enterprise",null,null,1.3509,1.3837999999999999]
[null,"IPAX (T)","Unladen","European Conventional",null,null,27,null,4,1202,"NACO_empty",4,null,"n/a",null,null,"IPAX (T)European Conventional",null,null,1.3585,1.4341999999999999]
[null,"IPAX (L)","Laden","Other",null,null,39.706999024217154,null,4,1202,"NACO_loaded",4,null,"n/a",null,null,"IPAX (L)Other",null,null,2.7145999999999999,3.7829999999999999]
[null,"IPAX (T)","Unladen","Other",null,null,27.024662633783155,null,4,1202,"NACO_empty",4,null,"n/a",null,null,"IPAX (T)Other",null,null,1.264,1.3587]
[null,"IQAD (T)","Unladen","Other",null,null,56,null,8,1344,"Y25_empty",5,null,"n/a",null,null,"IQAD (T)Other",null,null,0.99970000000000003,0.96940000000000004]
[null,"IVAL (L)","Laden","Domestic Automotive",null,null,29.16626788925382,null,2,1202,"2axle_loaded",2,null,"n/a",null,null,"IVAL (L)Domestic Automotive",null,null,2.5026000000000002,2.62]
[null,"IVAL (T)","Unladen","Domestic Automotive",null,null,17,null,2,1202,"2axle_empty",2,null,"n/a",null,null,"IVAL (T)Domestic Automotive",null,null,1.2797000000000001,1.5067999999999999]
[null,"IVAL (L)","Laden","Enterprise",null,null,29.478177800285437,null,2,1202,"2axle_loaded",2,null,"n/a",null,null,"IVAL (L)Enterprise",null,null,2.3677999999999999,2.6770999999999998]
[null,"IVAL (T)","Unladen","Enterprise",null,null,17,null,2,1202,"2axle_empty",2,null,"n/a",null,null,"IVAL (T)Enterprise",null,null,1.3143,1.5309999999999999]
[null,"IVAL (L)","Laden","Other",null,null,28.819549216690064,null,2,1202,"2axle_loaded",2,null,"n/a",null,null,"IVAL (L)Other",null,null,2.1271,2.5943000000000001]
[null,"IVAL (T)","Unladen","Other",null,null,17,null,2,1202,"2axle_empty",2,null,"n/a",null,null,"IVAL (T)Other",null,null,1.2251000000000001,1.5067999999999999]
[null,"IWAB (L)","Laden","Construction Materials",null,null,64.936000000000007,null,4,1202,"NACO_loaded",4,null,"n/a",null,null,"IWAB (L)Construction Materials",null,null,2.5707,3.8020999999999998]
[null,"IWAB (T)","Unladen","Construction Materials",null,null,27,null,4,1202,"NACO_empty",4,null,"n/a",null,null,"IWAB (T)Construction Materials",null,null,1.2375,1.4089]
[null,"IWAB (T)","Unladen","Domestic Intermodal",null,null,27,null,4,1202,"NACO_empty",4,null,"n/a",null,null,"IWAB (T)Domestic Intermodal",null,null,1.3095000000000001,1.4595]
[null,"IWAB (L)","Laden","Enterprise",null,null,63.803090727816553,null,4,1202,"NACO_loaded",4,null,"n/a",null,null,"IWAB (L)Enterprise",null,null,2.9308999999999998,3.7359]
[null,"IWAB (T)","Unladen","Enterprise",null,null,27,null,4,1202,"NACO_empty",4,null,"n/a",null,null,"IWAB (T)Enterprise",null,null,1.3088,1.3836999999999999]
[null,"IWAB (L)","Laden","European Conventional",null,null,51.475102826638661,null,4,1202,"NACO_loaded",4,null,"n/a",null,null,"IWAB (L)European Conventional",null,null,2.8887,3.6311]
[null,"IWAB (L)","Laden","European Intermodal",null,null,51.49554140127389,null,4,1202,"NACO_loaded",4,null,"n/a",null,null,"IWAB (L)European Intermodal",null,null,3.0722,3.7229999999999999]
[null,"IWAB (L)","Laden","Industrial Minerals",null,null,64.048922964585614,null,4,1202,"NACO_loaded",4,null,"n/a",null,null,"IWAB (L)Industrial Minerals",null,null,2.8228,3.6012]
[null,"IWAB (T)","Unladen","Industrial Minerals",null,null,27,null,4,1202,"NACO_empty",4,null,"n/a",null,null,"IWAB (T)Industrial Minerals",null,null,1.1926000000000001,1.2713000000000001]
[null,"IWAB (L)","Laden","Other",null,null,60.017513566847555,null,4,1202,"NACO_loaded",4,null,"n/a",null,null,"IWAB (L)Other",null,null,2.7936000000000001,3.6221000000000001]
[null,"IWAB (T)","Unladen","Other",null,null,27,null,4,1202,"NACO_empty",4,null,"n/a",null,null,"IWAB (T)Other",null,null,1.2245999999999999,1.3586]
[null,"IWAB (L)","Laden","Steel",null,null,86.227342084726232,null,4,1202,"NACO_loaded",4,null,"n/a",null,null,"IWAB (L)Steel",null,null,3.1402000000000001,4.8315999999999999]
[null,"IWAB (T)","Unladen","Steel",null,null,27,null,4,1202,"NACO_empty",4,null,"n/a",null,null,"IWAB (T)Steel",null,null,1.2293000000000001,1.3586]
[null,"IWBB (L)","Laden","European Conventional",null,null,50.9011466296039,null,4,1202,"NACO_loaded",4,null,"n/a",null,null,"IWBB (L)European Conventional",null,null,2.7732000000000001,3.6320999999999999]
[null,"IWBB (L)","Laden","European Intermodal",null,null,50.854945054945055,null,4,1202,"NACO_loaded",4,null,"n/a",null,null,"IWBB (L)European Intermodal",null,null,2.9222999999999999,3.7227999999999999]
[null,"IWBB (T)","Unladen","European Intermodal",null,null,27,null,4,1202,"NACO_empty",4,null,"n/a",null,null,"IWBB (T)European Intermodal",null,null,1.3344,1.5229999999999999]
[null,"IWBB (L)","Laden","Other",null,null,50.867111216956417,null,4,1202,"NACO_loaded",4,null,"n/a",null,null,"IWBB (L)Other",null,null,2.6257999999999999,3.5586000000000002]
[null,"IWBB (T)","Unladen","Other",null,null,26,null,4,1202,"NACO_empty",4,null,"n/a",null,null,"IWBB (T)Other",null,null,1.2302999999999999,1.3577999999999999]
[null,"IXAA (L)","Laden","Domestic Intermodal",null,null,56,null,4,1060,"Y25_loaded",5,null,"n/a",null,null,"IXAA (L)Domestic Intermodal"]
[null,"IXAA (T)","Unladen","Domestic Intermodal",null,null,16.5,null,4,1060,"Y25_empty",5,null,"n/a",null,null,"IXAA (T)Domestic Intermodal"]
[null,"IZAL (L)","Laden","Enterprise",null,null,81.281748291571759,null,4,1202,"2axle_loaded",2,null,"n/a",null,null,"IZAL (L)Enterprise",null,null,2.64,3.7050000000000001]
[null,"IZAL (T)","Unladen","Enterprise",null,null,27,null,4,1202,"2axle_empty",2,null,"n/a",null,null,"IZAL (T)Enterprise",null,null,1.1526000000000001,1.1778999999999999]
[null,"IZAL (L)","Laden","European Automotive",null,null,80.817900172117035,null,4,1202,"2axle_loaded",2,null,"n/a",null,null,"IZAL (L)European Automotive",null,null,2.8311000000000002,3.7818000000000001]
[null,"IZAL (T)","Unladen","European Automotive",null,null,27,null,4,1202,"2axle_empty",2,null,"n/a",null,null,"IZAL (T)European Automotive",null,null,1.1445000000000001,1.2321]
[null,"IZAL (L)","Laden","European Conventional",null,null,75.334391294491041,null,4,1202,"2axle_loaded",2,null,"n/a",null,null,"IZAL (L)European Conventional",null,null,2.5148999999999999,3.3386999999999998]
[null,"IZAL (T)","Unladen","European Conventional",null,null,27,null,4,1202,"2axle_empty",2,null,"n/a",null,null,"IZAL (T)European Conventional",null,null,1.1708000000000001,1.2321]
[null,"IZAL (L)","Laden","European Intermodal",null,null,74.361494719740051,null,4,1202,"2axle_loaded",2,null,"n/a",null,null,"IZAL (L)European Intermodal",null,null,2.7113,3.4466000000000001]
[null,"IZAL (T)","Unladen","European Intermodal",null,null,27,null,4,1202,"2axle_empty",2,null,"n/a",null,null,"IZAL (T)European Intermodal",null,null,1.1765000000000001,1.3277000000000001]
[null,"IZAL (L)","Laden","Other",null,null,53.25,null,4,1202,"2axle_loaded",2,null,"n/a",null,null,"IZAL (L)Other",null,null,1.9527000000000001,2.0562999999999998]
[null,"IZAL (T)","Unladen","Other",null,null,27,null,4,1202,"2axle_empty",2,null,"n/a",null,null,"IZAL (T)Other",null,null,1.0628,1.1508]
[null,"IZAN (L)","Laden","European Automotive",null,null,78.938564476885645,null,4,1202,"2axle_loaded",2,null,"n/a",null,null,"IZAN (L)European Automotive",null,null,2.8515000000000001,3.6221999999999999]
[null,"IZAN (T)","Unladen","European Automotive",null,null,27,null,4,1202,"2axle_empty",2,null,"n/a",null,null,"IZAN (T)European Automotive",null,null,1.1445000000000001,1.2321]
[null,"IZAN (L)","Laden","European Conventional",null,null,75.289467705507377,null,4,1202,"2axle_loaded",2,null,"n/a",null,null,"IZAN (L)European Conventional",null,null,2.548,3.3353999999999999]
[null,"IZAN (T)","Unladen","European Conventional",null,null,27.021758818339578,null,4,1202,"2axle_empty",2,null,"n/a",null,null,"IZAN (T)European Conventional",null,null,1.1708000000000001,1.2323999999999999]
[null,"IZAN (L)","Laden","European Intermodal",null,null,70.409665685085741,null,4,1202,"2axle_loaded",2,null,"n/a",null,null,"IZAN (L)European Intermodal",null,null,2.6777000000000002,3.1545999999999998]
[null,"IZAN (T)","Unladen","European Intermodal",null,null,27,null,4,1202,"2axle_empty",2,null,"n/a",null,null,"IZAN (T)European Intermodal",null,null,1.1765000000000001,1.3277000000000001]
[null,"IZAN (T)","Unladen","Other",null,null,27,null,4,1202,"2axle_empty",2,null,"n/a",null,null,"IZAN (T)Other",null,null,1.0628,1.1508]
[null,"JEAI (L)","Laden","Industrial Minerals",null,null,100.5698114910484,null,4,2062,"NACO_loaded",4,null,"n/a",null,null,"JEAI (L)Industrial Minerals",null,null,3.7166999999999999,5.9305000000000003]
[null,"JEAI (T)","Unladen","Industrial Minerals",null,null,25,null,4,2062,"NACO_empty",4,null,"n/a",null,null,"JEAI (T)Industrial Minerals",null,null,1.2383999999999999,1.2494000000000001]
[null,"JEAO (L)","Laden","Industrial Minerals",null,null,100.60282959282496,null,4,2062,"NACO_loaded",4,null,"n/a",null,null,"JEAO (L)Industrial Minerals",null,null,3.7181999999999999,5.9343000000000004]
[null,"JEAO (T)","Unladen","Industrial Minerals",null,null,26,null,4,2062,"NACO_empty",4,null,"n/a",null,null,"JEAO (T)Industrial Minerals",null,null,1.2354000000000001,1.2518]
[null,"JFAB (L)","Laden","Construction Materials",null,null,98.286126048612601,null,4,1280,"LN25_loaded",6,null,"n/a",null,null,"JFAB (L)Construction Materials",null,null,2.9329999999999998,4.9034000000000004]
[null,"JFAB (T)","Unladen","Construction Materials",null,null,22,null,4,1280,"LN25_empty",6,null,"n/a",null,null,"JFAB (T)Construction Materials",null,null,1.0168999999999999,1.0727]
[null,"JGAK (L)","Laden","Coal ESI",null,null,87.38882709183045,null,4,1344,"Y25_loaded",5,null,"n/a",null,null,"JGAK (L)Coal ESI",null,null,2.3306,3.7437]
[null,"JGAK (T)","Unladen","Coal ESI",null,null,22.546056754095428,null,4,1344,"Y25_empty",5,null,"n/a",null,null,"JGAK (T)Coal ESI",null,null,1.0381,1.0902000000000001]
[null,"JGAK (L)","Laden","Construction Materials",null,null,87.453406040550561,null,4,1344,"Y25_loaded",5,null,"n/a",null,null,"JGAK (L)Construction Materials",null,null,2.4594999999999998,3.9201999999999999]
[null,"JGAK (T)","Unladen","Construction Materials",null,null,22.58455942002638,null,4,1344,"Y25_empty",5,null,"n/a",null,null,"JGAK (T)Construction Materials",null,null,1.0620000000000001,1.1757]
[null,"JGAK (L)","Laden","Domestic Waste",null,null,82.769146764161249,null,4,1344,"Y25_loaded",5,null,"n/a",null,null,"JGAK (L)Domestic Waste",null,null,2.4121999999999999,3.3620000000000001]
[null,"JGAK (T)","Unladen","Domestic Waste",null,null,22.235270005346642,null,4,1344,"Y25_empty",5,null,"n/a",null,null,"JGAK (T)Domestic Waste",null,null,1.0944,1.0894999999999999]
[null,"JGAK (L)","Laden","Enterprise",null,null,61.870051234280396,null,4,1344,"Y25_loaded",5,null,"n/a",null,null,"JGAK (L)Enterprise",null,null,2.0236999999999998,2.1858]
[null,"JGAK (T)","Unladen","Enterprise",null,null,22.335450346420327,null,4,1344,"Y25_empty",5,null,"n/a",null,null,"JGAK (T)Enterprise",null,null,1.1120000000000001,1.1414]
[null,"JGAK (L)","Laden","Industrial Minerals",null,null,87.552516310131551,null,4,1344,"Y25_loaded",5,null,"n/a",null,null,"JGAK (L)Industrial Minerals",null,null,2.3603000000000001,3.5731999999999999]
[null,"JGAK (T)","Unladen","Industrial Minerals",null,null,22.191128833162516,null,4,1344,"Y25_empty",5,null,"n/a",null,null,"JGAK (T)Industrial Minerals",null,null,1.0029999999999999,0.98570000000000002]
[null,"JGAK (L)","Laden","Other",null,null,50.323076923076918,null,4,1344,"Y25_loaded",5,null,"n/a",null,null,"JGAK (L)Other",null,null,1.7491000000000001,1.7442]
[null,"JGAK (T)","Unladen","Other",null,null,22.398052152057808,null,4,1344,"Y25_empty",5,null,"n/a",null,null,"JGAK (T)Other",null,null,1.0416000000000001,1.107]
[null,"JGAK (L)","Laden","Steel",null,null,89.99636363636364,null,4,1344,"Y25_loaded",5,null,"n/a",null,null,"JGAK (L)Steel",null,null,2.4958,4.0164999999999997]
[null,"JGAK (T)","Unladen","Steel",null,null,22.00915867944622,null,4,1344,"Y25_empty",5,null,"n/a",null,null,"JGAK (T)Steel",null,null,1.0347999999999999,1.1065]
[null,"JGAL (L)","Laden","Industrial Minerals",null,null,83.273332707372035,null,4,1344,"Y25_loaded",5,null,"n/a",null,null,"JGAL (L)Industrial Minerals",null,null,2.2515999999999998,3.2374000000000001]
[null,"JGAL (T)","Unladen","Industrial Minerals",null,null,27.733202761917411,null,4,1344,"Y25_empty",5,null,"n/a",null,null,"JGAL (T)Industrial Minerals",null,null,1.0179,1.036]
[null,"JGAM (L)","Laden","Construction Materials",null,null,87.463148822535175,null,4,1330,"LN25_loaded",6,null,"n/a",null,null,"JGAM (L)Construction Materials",null,null,2.4137,3.7804000000000002]
[null,"JGAM (T)","Unladen","Construction Materials",null,null,24,null,4,1330,"LN25_empty",6,null,"n/a",null,null,"JGAM (T)Construction Materials",null,null,1.0450999999999999,1.0873999999999999]
[null,"JGAN (L)","Laden","Construction Materials",null,null,98.908982618616193,null,4,1330,"LN25_loaded",6,null,"n/a",null,null,"JGAN (L)Construction Materials",null,null,2.9943,4.9808000000000003]
[null,"JGAN (T)","Unladen","Construction Materials",null,null,24,null,4,1330,"LN25_empty",6,null,"n/a",null,null,"JGAN (T)Construction Materials",null,null,1.0477000000000001,1.0873999999999999]
[null,"JGAP (L)","Laden","Construction Materials",null,null,101.54,null,4,1331.6,"LN25_loaded",6,null,"n/a",null,null,"JGAP (L)Construction Materials"]
[null,"JGAP (T)","Unladen","Construction Materials",null,null,23.36,null,4,1331.6,"LN25_empty",6,null,"n/a",null,null,"JGAP (T)Construction Materials"]
[null,"JHAI (L)","Laden","Construction Materials",null,null,98.332562311552579,null,4,1280,"LN25_loaded",6,null,"n/a",null,null,"JHAI (L)Construction Materials",null,null,2.9346000000000001,4.9089]
[null,"JHAI (T)","Unladen","Construction Materials",null,null,23.297182674245942,null,4,1280,"LN25_empty",6,null,"n/a",null,null,"JHAI (T)Construction Materials",null,null,1.0107999999999999,1.075]
[null,"JHAL (L)","Laden","Construction Materials",null,null,98.419054236633841,null,4,2235,"3piece_loaded",3,null,"n/a",null,null,"JHAL (L)Construction Materials",null,null,3.8607999999999998,6.2946]
[null,"JHAL (T)","Unladen","Construction Materials",null,null,27.931167593114747,null,4,2235,"3piece_empty",3,null,"n/a",null,null,"JHAL (T)Construction Materials",null,null,1.4662999999999999,1.7069000000000001]
[null,"JHAO (L)","Laden","Construction Materials",null,null,98.33704602641356,null,4,1280,"Y25_loaded",6,null,"n/a",null,null,"JHAO (L)Construction Materials",null,null,2.9348999999999998,4.9153000000000002]
[null,"JHAO (T)","Unladen","Construction Materials",null,null,23.371420039662311,null,4,1280,"Y25_empty",6,null,"n/a",null,null,"JHAO (T)Construction Materials",null,null,1.0089999999999999,1.1299999999999999]
[null,"JIAA (L)","Laden","Enterprise",null,null,89.266443621867893,null,4,1344,"Y25_loaded",5,null,"n/a",null,null,"JIAA (L)Enterprise",null,null,2.6252,4.0190000000000001]
[null,"JIAA (T)","Unladen","Enterprise",null,null,26,null,4,1344,"Y25_empty",5,null,"n/a",null,null,"JIAA (T)Enterprise",null,null,1.1229,1.153]
[null,"JIAA (L)","Laden","Industrial Minerals",null,null,89.023376115248197,null,4,1344,"Y25_loaded",5,null,"n/a",null,null,"JIAA (L)Industrial Minerals",null,null,2.4016000000000002,3.6978]
[null,"JIAA (T)","Unladen","Industrial Minerals",null,null,26,null,4,1344,"Y25_empty",5,null,"n/a",null,null,"JIAA (T)Industrial Minerals",null,null,1.0081,1.0169999999999999]
[null,"JIAB (L)","Laden","Industrial Minerals",null,null,83.477647348326101,null,4,1344,"Y25_loaded",5,null,"n/a",null,null,"JIAB (L)Industrial Minerals",null,null,2.1440999999999999,3.2524999999999999]
[null,"JIAB (T)","Unladen","Industrial Minerals",null,null,26,null,4,1344,"Y25_empty",5,null,"n/a",null,null,"JIAB (T)Industrial Minerals",null,null,1.0121,1.0169999999999999]
[null,"JJAB (L)","Laden","Construction Materials",null,null,88.034372135655374,null,4,1344,"Y25_loaded",5,null,"n/a",null,null,"JJAB (L)Construction Materials",null,null,2.4767999999999999,3.9746000000000001]
[null,"JJAB (T)","Unladen","Construction Materials",null,null,28,null,4,1344,"Y25_empty",5,null,"n/a",null,null,"JJAB (T)Construction Materials",null,null,1.0818000000000001,1.1962999999999999]
[null,"JNAA (L)","Laden","Biomass",null,null,102,null,4,1310,"Y25_loaded",6,null,"n/a",null,null,"JNAA (L)Biomass",null,null,3.1656,5.6523000000000003]
[null,"JNAA (T)","Unladen","Biomass",null,null,24.209139114160948,null,4,1310,"Y25_empty",6,null,"n/a",null,null,"JNAA (T)Biomass",null,null,1.0450999999999999,1.2111000000000001]
[null,"JNAA (L)","Laden","Coal ESI",null,null,101.82781436525441,null,4,1310,"Y25_loaded",6,null,"n/a",null,null,"JNAA (L)Coal ESI",null,null,2.9291999999999998,5.1009000000000002]
[null,"JNAA (T)","Unladen","Coal ESI",null,null,24.281041372917137,null,4,1310,"Y25_empty",6,null,"n/a",null,null,"JNAA (T)Coal ESI",null,null,0.98699999999999999,1.0637000000000001]
[null,"JNAA (L)","Laden","Coal Other",null,null,86.981353437123616,null,4,1310,"Y25_loaded",6,null,"n/a",null,null,"JNAA (L)Coal Other",null,null,2.5356999999999998,3.6082999999999998]
[null,"JNAA (T)","Unladen","Coal Other",null,null,24.300232766338407,null,4,1310,"Y25_empty",6,null,"n/a",null,null,"JNAA (T)Coal Other",null,null,0.99180000000000001,1.0784]
[null,"JNAA (L)","Laden","Construction Materials",null,null,95.636518694077537,null,4,1310,"Y25_loaded",6,null,"n/a",null,null,"JNAA (L)Construction Materials",null,null,2.8372999999999999,4.6051000000000002]
[null,"JNAA (T)","Unladen","Construction Materials",null,null,23.221457062783823,null,4,1310,"Y25_empty",6,null,"n/a",null,null,"JNAA (T)Construction Materials",null,null,1.0202,1.1362000000000001]
[null,"JNAA (T)","Unladen","Domestic Intermodal",null,null,24.796370967741936,null,4,1310,"Y25_empty",6,null,"n/a",null,null,"JNAA (T)Domestic Intermodal",null,null,1.0686,1.1964999999999999]
[null,"JNAA (T)","Unladen","Enterprise",null,null,24.480512820512821,null,4,1310,"Y25_empty",6,null,"n/a",null,null,"JNAA (T)Enterprise",null,null,1.0595000000000001,1.1084000000000001]
[null,"JNAA (L)","Laden","Industrial Minerals",null,null,96.845682880971893,null,4,1310,"Y25_loaded",6,null,"n/a",null,null,"JNAA (L)Industrial Minerals",null,null,2.7637999999999998,4.2845000000000004]
[null,"JNAA (T)","Unladen","Industrial Minerals",null,null,24.389268408928427,null,4,1310,"Y25_empty",6,null,"n/a",null,null,"JNAA (T)Industrial Minerals",null,null,0.96589999999999998,0.97670000000000001]
[null,"JNAA (L)","Laden","Other",null,null,79.8,null,4,1310,"Y25_loaded",6,null,"n/a",null,null,"JNAA (L)Other",null,null,2.3321000000000001,3.0554999999999999]
[null,"JNAA (T)","Unladen","Other",null,null,24.610025062656639,null,4,1310,"Y25_empty",6,null,"n/a",null,null,"JNAA (T)Other",null,null,0.99219999999999997,1.0797000000000001]
[null,"JNAA (L)","Laden","Steel",null,null,94.448059102642617,null,4,1310,"Y25_loaded",6,null,"n/a",null,null,"JNAA (L)Steel",null,null,2.7648000000000001,4.3082000000000003]
[null,"JNAA (T)","Unladen","Steel",null,null,24.39565224255799,null,4,1310,"Y25_empty",6,null,"n/a",null,null,"JNAA (T)Steel",null,null,1.0065,1.0788]
[null,"JNAB (L)","Laden","Construction Materials",null,null,86.745969816302846,null,4,1344,"Y25_loaded",5,null,"n/a",null,null,"JNAB (L)Construction Materials",null,null,2.5219,3.8551000000000002]
[null,"JNAB (T)","Unladen","Construction Materials",null,null,28.56168349094678,null,4,1344,"Y25_empty",5,null,"n/a",null,null,"JNAB (T)Construction Materials",null,null,1.1112,1.2009000000000001]
[null,"JNAB (L)","Laden","Enterprise",null,null,68.466666666666669,null,4,1344,"Y25_loaded",5,null,"n/a",null,null,"JNAB (L)Enterprise",null,null,2.2071999999999998,2.5051000000000001]
[null,"JNAB (T)","Unladen","Enterprise",null,null,28.202295552367289,null,4,1344,"Y25_empty",5,null,"n/a",null,null,"JNAB (T)Enterprise",null,null,1.1778999999999999,1.1693]
[null,"JNAB (L)","Laden","Industrial Minerals",null,null,79.55458619185471,null,4,1344,"Y25_loaded",5,null,"n/a",null,null,"JNAB (L)Industrial Minerals",null,null,2.2170000000000001,2.9756]
[null,"JNAB (T)","Unladen","Industrial Minerals",null,null,28.419298627749949,null,4,1344,"Y25_empty",5,null,"n/a",null,null,"JNAB (T)Industrial Minerals",null,null,1.0586,1.0443]
[null,"JNAB (L)","Laden","Other",null,null,88,null,4,1344,"Y25_loaded",5,null,"n/a",null,null,"JNAB (L)Other",null,null,2.4878999999999998,3.8313999999999999]
[null,"JNAB (T)","Unladen","Other",null,null,28.641185431380698,null,4,1344,"Y25_empty",5,null,"n/a",null,null,"JNAB (T)Other",null,null,1.0939000000000001,1.1451]
[null,"JNAB (L)","Laden","Steel",null,null,68.611344537815128,null,4,1344,"Y25_loaded",5,null,"n/a",null,null,"JNAB (L)Steel",null,null,2.0442,2.4733999999999998]
[null,"JNAB (T)","Unladen","Steel",null,null,28.469941822883001,null,4,1344,"Y25_empty",5,null,"n/a",null,null,"JNAB (T)Steel",null,null,1.0923,1.1434]
[null,"JNAC (L)","Laden","Construction Materials",null,null,77.706762868834815,null,4,2105,"3piece_loaded",3,null,"n/a",null,null,"JNAC (L)Construction Materials",null,null,3.2926000000000002,4.3968999999999996]
[null,"JNAC (T)","Unladen","Construction Materials",null,null,26,null,4,2105,"3piece_empty",3,null,"n/a",null,null,"JNAC (T)Construction Materials",null,null,1.4384999999999999,1.6969000000000001]
[null,"JNAC (T)","Unladen","Enterprise",null,null,26,null,4,2105,"3piece_empty",3,null,"n/a",null,null,"JNAC (T)Enterprise",null,null,1.4987999999999999,1.6321000000000001]
[null,"JNAC (L)","Laden","Steel",null,null,85.873362445414841,null,4,2105,"3piece_loaded",3,null,"n/a",null,null,"JNAC (L)Steel",null,null,3.4542999999999999,4.8406000000000002]
[null,"JNAC (T)","Unladen","Steel",null,null,26,null,4,2105,"3piece_empty",3,null,"n/a",null,null,"JNAC (T)Steel",null,null,1.3947000000000001,1.5673999999999999]
[null,"JNAD (L)","Laden","Construction Materials",null,null,97.586551279434815,null,4,1330,"LN25_loaded",6,null,"n/a",null,null,"JNAD (L)Construction Materials",null,null,2.8328000000000002,4.8230000000000004]
[null,"JNAD (T)","Unladen","Construction Materials",null,null,22.216308449987956,null,4,1330,"LN25_empty",6,null,"n/a",null,null,"JNAD (T)Construction Materials",null,null,1.0222,1.0838000000000001]
[null,"JNAG (L)","Laden","Coal Other",null,null,74.863013698630127,null,4,2105,"3piece_loaded",3,null,"n/a",null,null,"JNAG (L)Coal Other",null,null,3.1213000000000002,4.1093999999999999]
[null,"JNAG (T)","Unladen","Coal Other",null,null,27,null,4,2105,"3piece_empty",3,null,"n/a",null,null,"JNAG (T)Coal Other",null,null,1.3936999999999999,1.5624]
[null,"JNAG (L)","Laden","Construction Materials",null,null,94.098746745777078,null,4,2105,"3piece_loaded",3,null,"n/a",null,null,"JNAG (L)Construction Materials",null,null,3.6852,5.7843]
[null,"JNAG (T)","Unladen","Construction Materials",null,null,27,null,4,2105,"3piece_empty",3,null,"n/a",null,null,"JNAG (T)Construction Materials",null,null,1.4314,1.6876]
[null,"JNAG (L)","Laden","Domestic Waste",null,null,74.211139553358649,null,4,2105,"3piece_loaded",3,null,"n/a",null,null,"JNAG (L)Domestic Waste",null,null,3.2850000000000001,4.0465999999999998]
[null,"JNAG (T)","Unladen","Domestic Waste",null,null,27,null,4,2105,"3piece_empty",3,null,"n/a",null,null,"JNAG (T)Domestic Waste",null,null,1.4662999999999999,1.5311999999999999]
[null,"JNAG (L)","Laden","Industrial Minerals",null,null,94.972839506172832,null,4,2105,"3piece_loaded",3,null,"n/a",null,null,"JNAG (L)Industrial Minerals",null,null,3.5581999999999998,5.391]
[null,"JNAG (T)","Unladen","Industrial Minerals",null,null,27,null,4,2105,"3piece_empty",3,null,"n/a",null,null,"JNAG (T)Industrial Minerals",null,null,1.3198000000000001,1.3441000000000001]
[null,"JNAG (T)","Unladen","Other",null,null,27,null,4,2105,"3piece_empty",3,null,"n/a",null,null,"JNAG (T)Other",null,null,1.3936999999999999,1.5624]
[null,"JNAG (L)","Laden","Steel",null,null,88.479003536246537,null,4,2105,"3piece_loaded",3,null,"n/a",null,null,"JNAG (L)Steel",null,null,3.4369999999999998,5.0595999999999997]
[null,"JNAG (T)","Unladen","Steel",null,null,27,null,4,2105,"3piece_empty",3,null,"n/a",null,null,"JNAG (T)Steel",null,null,1.3936999999999999,1.5624]
[null,"JNAN (L)","Laden","Coal ESI",null,null,79.5,null,4,2105,"3piece_Loaded",3,null,"n/a",null,null,"JNAN (L)Coal ESI",null,null,2.8525999999999998,4.3491]
[null,"JNAN (T)","Unladen","Coal ESI",null,null,25.98,null,4,2105,"3piece_Empty",3,null,"n/a",null,null,"JNAN (T)Coal ESI",null,null,1.3835999999999999,1.5351999999999999]
[null,"JNAN (L)","Laden","Coal Other",null,null,74.32869664634147,null,4,2105,"3piece_loaded",3,null,"n/a",null,null,"JNAN (L)Coal Other",null,null,3.1120000000000001,4.0812999999999997]
[null,"JNAN (T)","Unladen","Coal Other",null,null,26,null,4,2105,"3piece_empty",3,null,"n/a",null,null,"JNAN (T)Coal Other",null,null,1.3932,1.5673999999999999]
[null,"JNAN (L)","Laden","Construction Materials",null,null,94.230098938004915,null,4,2105,"3piece_loaded",3,null,"n/a",null,null,"JNAN (L)Construction Materials",null,null,3.6981000000000002,5.7986000000000004]
[null,"JNAN (T)","Unladen","Construction Materials",null,null,26,null,4,2105,"3piece_empty",3,null,"n/a",null,null,"JNAN (T)Construction Materials",null,null,1.4278999999999999,1.6969000000000001]
[null,"JNAN (L)","Laden","Industrial Minerals",null,null,96.997333333333344,null,4,2105,"3piece_loaded",3,null,"n/a",null,null,"JNAN (L)Industrial Minerals",null,null,3.6286,5.6009000000000002]
[null,"JNAN (T)","Unladen","Industrial Minerals",null,null,26,null,4,2105,"3piece_empty",3,null,"n/a",null,null,"JNAN (T)Industrial Minerals",null,null,1.3167,1.3413999999999999]
[null,"JNAN (L)","Laden","Iron Ore",null,null,72.226275738585485,null,4,2105,"3piece_loaded",3,null,"n/a",null,null,"JNAN (L)Iron Ore",null,null,2.9674999999999998,3.9771000000000001]
[null,"JNAN (T)","Unladen","Iron Ore",null,null,26,null,4,2105,"3piece_empty",3,null,"n/a",null,null,"JNAN (T)Iron Ore",null,null,1.3932,1.5673999999999999]
[null,"JNAN (L)","Laden","Other",null,null,55,null,4,2105,"3piece_loaded",3,null,"n/a",null,null,"JNAN (L)Other",null,null,2.9096000000000002,3.4828000000000001]
[null,"JNAN (T)","Unladen","Other",null,null,25.912337662337663,null,4,2105,"3piece_empty",3,null,"n/a",null,null,"JNAN (T)Other",null,null,1.3933,1.5679000000000001]
[null,"JNAN (L)","Laden","Steel",null,null,86.580664386401338,null,4,2105,"3piece_loaded",3,null,"n/a",null,null,"JNAN (L)Steel",null,null,3.3834,4.8982000000000001]
[null,"JNAN (T)","Unladen","Steel",null,null,25.999714564353848,null,4,2105,"3piece_empty",3,null,"n/a",null,null,"JNAN (T)Steel",null,null,1.3932,1.5673999999999999]
[null,"JNAS (L)","Laden","Coal Other",null,null,89.147393407380875,null,4,2105,"3piece_loaded",3,null,"n/a","Retain. Potential future use - GBRf",null,"JNAS (L)Coal Other",null,null,3.3837999999999999,5.1188000000000002]
[null,"JNAS (T)","Unladen","Coal Other",null,null,32,null,4,2105,"3piece_empty",3,null,"n/a","Retain. Potential future use - GBRf",null,"JNAS (T)Coal Other",null,null,1.4111,1.5685]
[null,"JNAS (L)","Laden","Construction Materials",null,null,96.982019693330159,null,4,2105,"3piece_loaded",3,null,"n/a",null,null,"JNAS (L)Construction Materials",null,null,3.8754,6.1128]
[null,"JNAS (T)","Unladen","Construction Materials",null,null,32,null,4,2105,"3piece_empty",3,null,"n/a",null,null,"JNAS (T)Construction Materials",null,null,1.4443999999999999,1.677]
[null,"JNAS (T)","Unladen","Enterprise",null,null,32,null,4,2105,"3piece_empty",3,null,"n/a",null,null,"JNAS (T)Enterprise",null,null,1.5174000000000001,1.6227]
[null,"JNAS (L)","Laden","Industrial Minerals",null,null,98.132617682357662,null,4,2105,"3piece_loaded",3,null,"n/a",null,null,"JNAS (L)Industrial Minerals",null,null,3.6659000000000002,5.7244000000000002]
[null,"JNAS (T)","Unladen","Industrial Minerals",null,null,32,null,4,2105,"3piece_empty",3,null,"n/a",null,null,"JNAS (T)Industrial Minerals",null,null,1.3442000000000001,1.3796999999999999]
[null,"JNAS (L)","Laden","Other",null,null,99.377777777777794,null,4,2105,"3piece_loaded",3,null,"n/a",null,null,"JNAS (L)Other",null,null,3.7793000000000001,6.1977000000000002]
[null,"JNAS (T)","Unladen","Other",null,null,32,null,4,2105,"3piece_empty",3,null,"n/a",null,null,"JNAS (T)Other",null,null,1.4111,1.5685]
[null,"JNAS (L)","Laden","Steel",null,null,86,null,4,2105,"3piece_loaded",3,null,"n/a",null,null,"JNAS (L)Steel"]
[null,"JNAS (T)","Unladen","Steel",null,null,32,null,4,2105,"3piece_empty",3,null,"n/a",null,null,"JNAS (T)Steel"]
[null,"JNAT (L)","Laden","Construction Materials",null,null,95.636499999999998,null,4,1330,"LN25_loaded",6,null,"n/a",null,null,"JNAT (L)Construction Materials",null,null,2.7279,4.6001000000000003]
[null,"JNAT (T)","Unladen","Construction Materials",null,null,24,null,4,1330,"LN25_empty",6,null,"n/a",null,null,"JNAT (T)Construction Materials",null,null,1.026,1.0873999999999999]
[null,"JNAT (L)","Laden","Domestic Waste",null,null,95.636499999999998,null,4,1330,"LN25_loaded",6,null,"n/a",null,null,"JNAT (L)Domestic Waste",null,null,2.8104,4.3863000000000003]
[null,"JNAT (T)","Unladen","Domestic Waste",null,null,24,null,4,1330,"LN25_empty",6,null,"n/a",null,null,"JNAT (T)Domestic Waste",null,null,1.0641,1.0111000000000001]
[null,"JNAT (L)","Laden","Industrial Minerals",null,null,95.636499999999998,null,4,1330,"LN25_loaded",6,null,"n/a",null,null,"JNAT (L)Industrial Minerals",null,null,2.6004999999999998,4.1566000000000001]
[null,"JNAT (T)","Unladen","Industrial Minerals",null,null,24,null,4,1330,"LN25_empty",6,null,"n/a",null,null,"JNAT (T)Industrial Minerals",null,null,0.96940000000000004,0.92]
[null,"JNAT (L)","Laden","Iron Ore",null,null,95.636499999999998,null,4,1330,"LN25_loaded",6,null,"n/a",null,null,"JNAT (L)Iron Ore",null,null,2.5926999999999998,4.4275000000000002]
[null,"JNAT (T)","Unladen","Iron Ore",null,null,24,null,4,1330,"LN25_empty",6,null,"n/a",null,null,"JNAT (T)Iron Ore",null,null,1.0053000000000001,1.0264]
[null,"JNAT (L)","Laden","Steel",null,null,95.636499999999998,null,4,1330,"LN25_loaded",6,null,"n/a",null,null,"JNAT (L)Steel",null,null,2.6785000000000001,4.4275000000000002]
[null,"JNAT (T)","Unladen","Steel",null,null,24,null,4,1330,"LN25_empty",6,null,"n/a",null,null,"JNAT (T)Steel",null,null,1.0053000000000001,1.0264]
[null,"JNAU (L)","Laden","Construction Materials",null,null,93.8,null,4,1336,"Y25_loaded","n/a",null,0.874,null,null,"JNAU (L)Construction Materials"]
[null,"JNAU (T)","Unladen","Construction Materials",null,null,24.05,null,4,1336,"Y25_empty","n/a",null,0.92600000000000005,null,null,"JNAU (T)Construction Materials"]
[null,"JNAV (L)","Laden","Construction Materials",null,null,101.6,null,4,1338,"LN25_loaded","n/a",null,0.873,null,null,"JNAV (L)Construction Materials"]
[null,"JNAV (T)","Unladen","Construction Materials",null,null,22,null,4,1338,"LN25_empty","n/a",null,0.877,null,null,"JNAV (T)Construction Materials"]
[null,"JPAA (L)","Laden","Construction Materials",null,null,98.584195570011147,null,4,1332,"LN25_loaded",6,null,"n/a",null,null,"JPAA (L)Construction Materials",null,null,2.9416000000000002,4.9417]
[null,"JPAA (T)","Unladen","Construction Materials",null,null,20,null,4,1332,"LN25_empty",6,null,"n/a",null,null,"JPAA (T)Construction Materials",null,null,1.0226999999999999,1.0878000000000001]
[null,"JPAC (L)","Laden","Construction Materials",null,null,99.956999999999994,null,4,2661,"LN25_Loaded","n/a",null,0.93,null,null,"JPAC (L)Construction Materials",null,null,3.1930999999999998,5.3209999999999997]
[null,"JPAC (T)","Unladen","Construction Materials",null,null,19.905999999999999,null,4,2661,"LN25_Empty","n/a",null,0.88500000000000001,null,null,"JPAC (T)Construction Materials",null,null,1.1813,1.3973]
[null,"JPAD (L)","Laden","Construction Materials",null,null,98.451999999999998,null,4,1332,"LN25_Loaded",6,null,"n/a",null,null,"JPAD (L)Construction Materials",null,null,2.8811,4.9257999999999997]
[null,"JPAD (T)","Unladen","Construction Materials",null,null,20,null,4,1332,"LN25_empty",6,null,"n/a",null,null,"JPAD (T)Construction Materials",null,null,1.0232000000000001,1.0878000000000001]
[null,"JPAE (L)","Laden","Construction Materials",null,null,101.6,null,4,2661,"LN25_loaded","n/a",null,0.93,null,null,"JPAE (L)Construction Materials"]
[null,"JPAE (T)","Unladen","Construction Materials",null,null,19.899999999999999,null,4,2661,"LN25_empty","n/a",null,0.88500000000000001,null,null,"JPAE (T)Construction Materials"]
[null,"JPAF (L)","Laden","Construction Materials",null,null,98.2,null,4,1331.5,"LN25_loaded",6,null,"n/a",null,null,"JPAF (L)Construction Materials"]
[null,"JPAF (T)","Unladen","Construction Materials",null,null,19.899999999999999,null,4,1331.5,"LN25_empty",6,null,"n/a",null,null,"JPAF (T)Construction Materials"]
[null,"JRAH (L)","Laden","Coal Other",null,null,89,null,4,1344,"Y25_loaded",5,null,"n/a",null,null,"JRAH (L)Coal Other",null,null,2.5106000000000002,3.9228999999999998]
[null,"JRAH (L)","Laden","Construction Materials",null,null,88.601048797062433,null,4,1344,"Y25_loaded",5,null,"n/a",null,null,"JRAH (L)Construction Materials",null,null,2.5392999999999999,4.0285000000000002]
[null,"JRAH (T)","Unladen","Construction Materials",null,null,22.606421595338894,null,4,1344,"Y25_empty",5,null,"n/a",null,null,"JRAH (T)Construction Materials",null,null,1.0733999999999999,1.1756]
[null,"JRAH (L)","Laden","Enterprise",null,null,87.4,null,4,1344,"Y25_loaded",5,null,"n/a",null,null,"JRAH (L)Enterprise",null,null,2.6160999999999999,3.8452999999999999]
[null,"JRAH (T)","Unladen","Enterprise",null,null,22,null,4,1344,"Y25_empty",5,null,"n/a",null,null,"JRAH (T)Enterprise",null,null,1.1373,1.1415]
[null,"JRAH (L)","Laden","Industrial Minerals",null,null,84.236673773987221,null,4,1344,"Y25_loaded",5,null,"n/a",null,null,"JRAH (L)Industrial Minerals",null,null,2.3157000000000001,3.3096000000000001]
[null,"JRAH (T)","Unladen","Industrial Minerals",null,null,22,null,4,1344,"Y25_empty",5,null,"n/a",null,null,"JRAH (T)Industrial Minerals",null,null,1.0150999999999999,0.98460000000000003]
[null,"JRAH (L)","Laden","Other",null,null,53.083869670152858,null,4,1344,"Y25_loaded",5,null,"n/a",null,null,"JRAH (L)Other",null,null,1.8211999999999999,1.827]
[null,"JRAH (T)","Unladen","Other",null,null,22,null,4,1344,"Y25_empty",5,null,"n/a",null,null,"JRAH (T)Other",null,null,1.0579000000000001,1.1065]
[null,"JSAA (T)","Unladen","Construction Materials",null,null,31,null,4,1764,"3piece_empty",3,null,"n/a",null,null,"JSAA (T)Construction Materials",null,null,1.4055,1.6145]
[null,"JSAA (T)","Unladen","Enterprise",null,null,31,null,4,1764,"3piece_empty",3,null,"n/a",null,null,"JSAA (T)Enterprise",null,null,1.4799,1.5708]
[null,"JSAA (L)","Laden","Industrial Minerals",null,null,89.786674353867483,null,4,1764,"3piece_loaded",3,null,"n/a",null,null,"JSAA (L)Industrial Minerals",null,null,3.3831000000000002,4.9116999999999997]
[null,"JSAA (T)","Unladen","Industrial Minerals",null,null,30.872960453757678,null,4,1764,"3piece_empty",3,null,"n/a",null,null,"JSAA (T)Industrial Minerals",null,null,1.3261000000000001,1.3743000000000001]
[null,"JSAA (L)","Laden","Other",null,null,96.5,null,4,1764,"3piece_loaded",3,null,"n/a",null,null,"JSAA (L)Other",null,null,3.6631,5.8479000000000001]
[null,"JSAA (T)","Unladen","Other",null,null,31,null,4,1764,"3piece_empty",3,null,"n/a",null,null,"JSAA (T)Other",null,null,1.3796999999999999,1.5271999999999999]
[null,"JSAA (L)","Laden","Steel",null,null,93.158711080132747,null,4,1764,"3piece_loaded",3,null,"n/a",null,null,"JSAA (L)Steel",null,null,3.5642999999999998,5.4898999999999996]
[null,"JSAA (T)","Unladen","Steel",null,null,30.865192090625285,null,4,1764,"3piece_empty",3,null,"n/a",null,null,"JSAA (T)Steel",null,null,1.3774999999999999,1.5265]
[null,"JSAC (L)","Laden","Steel",null,null,88.9,null,4,1764,"3piece_loaded",3,null,"n/a",null,null,"JSAC (L)Steel"]
[null,"JSAC (T)","Unladen","Steel",null,null,28.6,null,4,1764,"3piece_empty",3,null,"n/a",null,null,"JSAC (T)Steel"]
[null,"JTAE (L)","Laden","Construction Materials",null,null,95.975148620992115,null,4,1780,"3piece_loaded",3,null,"n/a",null,null,"JTAE (L)Construction Materials",null,null,3.7240000000000002,5.9762000000000004]
[null,"JTAE (T)","Unladen","Construction Materials",null,null,24,null,4,1780,"3piece_empty",3,null,"n/a",null,null,"JTAE (T)Construction Materials",null,null,1.407,1.6497999999999999]
[null,"JTAE (L)","Laden","Iron Ore",null,null,93.283430232558146,null,4,1780,"3piece_loaded",3,null,"n/a",null,null,"JTAE (L)Iron Ore",null,null,3.4546999999999999,5.5031999999999996]
[null,"JTAE (T)","Unladen","Iron Ore",null,null,24,null,4,1780,"3piece_empty",3,null,"n/a",null,null,"JTAE (T)Iron Ore",null,null,1.3697999999999999,1.54]
[null,"JTAE (L)","Laden","Steel",null,null,66.486282406242125,null,4,1780,"3piece_loaded",3,null,"n/a",null,null,"JTAE (L)Steel",null,null,2.9594999999999998,3.7256]
[null,"JTAE (T)","Unladen","Steel",null,null,24,null,4,1780,"3piece_empty",3,null,"n/a",null,null,"JTAE (T)Steel",null,null,1.3652,1.54]
[null,"JTAF (L)","Laden","Construction Materials",null,null,95.04693511156708,null,4,1780,"3piece_loaded",3,null,"n/a",null,null,"JTAF (L)Construction Materials",null,null,3.6932,5.8704000000000001]
[null,"JTAF (T)","Unladen","Construction Materials",null,null,24,null,4,1780,"3piece_empty",3,null,"n/a",null,null,"JTAF (T)Construction Materials",null,null,1.407,1.6497999999999999]
[null,"JTAF (L)","Laden","Iron Ore",null,null,93.398032620174462,null,4,1780,"3piece_loaded",3,null,"n/a",null,null,"JTAF (L)Iron Ore",null,null,3.4586000000000001,5.5148999999999999]
[null,"JTAF (T)","Unladen","Iron Ore",null,null,24,null,4,1780,"3piece_empty",3,null,"n/a",null,null,"JTAF (T)Iron Ore",null,null,1.3697999999999999,1.54]
[null,"JTAF (L)","Laden","Steel",null,null,67.84464189553043,null,4,1780,"3piece_loaded",3,null,"n/a",null,null,"JTAF (L)Steel",null,null,2.9761000000000002,3.7751999999999999]
[null,"JTAF (T)","Unladen","Steel",null,null,24,null,4,1780,"3piece_empty",3,null,"n/a",null,null,"JTAF (T)Steel",null,null,1.3652,1.54]
[null,"JUAD (L)","Laden","Construction Materials",null,null,95.867224117590794,null,4,1780,"3piece_loaded",3,null,"n/a",null,null,"JUAD (L)Construction Materials",null,null,3.7204999999999999,5.9638]
[null,"JUAD (T)","Unladen","Construction Materials",null,null,24,null,4,1780,"3piece_empty",3,null,"n/a",null,null,"JUAD (T)Construction Materials",null,null,1.407,1.6497999999999999]
[null,"JUAD (L)","Laden","Iron Ore",null,null,93.32684984285055,null,4,1780,"3piece_loaded",3,null,"n/a",null,null,"JUAD (L)Iron Ore",null,null,3.4561000000000002,5.5076999999999998]
[null,"JUAD (T)","Unladen","Iron Ore",null,null,24,null,4,1780,"3piece_empty",3,null,"n/a",null,null,"JUAD (T)Iron Ore",null,null,1.3697999999999999,1.54]
[null,"JUAD (L)","Laden","Steel",null,null,66.887165087165087,null,4,1780,"3piece_loaded",3,null,"n/a",null,null,"JUAD (L)Steel",null,null,2.9643000000000002,3.7397999999999998]
[null,"JUAD (T)","Unladen","Steel",null,null,24,null,4,1780,"3piece_empty",3,null,"n/a",null,null,"JUAD (T)Steel",null,null,1.3652,1.54]
[null,"JXAT (L)","Laden","Coal Other",null,null,73.9322278298486,null,4,1764,"Y25_loaded",5,null,"n/a",null,null,"JXAT (L)Coal Other",null,null,2.3372999999999999,2.7934000000000001]
[null,"JXAT (T)","Unladen","Coal Other",null,null,24,null,4,1764,"Y25_empty",5,null,"n/a",null,null,"JXAT (T)Coal Other",null,null,1.1473,1.165]
[null,"JXAT (L)","Laden","Construction Materials",null,null,93.463357380052685,null,4,1764,"Y25_loaded",5,null,"n/a",null,null,"JXAT (L)Construction Materials",null,null,2.9106999999999998,4.5483000000000002]
[null,"JXAT (T)","Unladen","Construction Materials",null,null,24.002425222312048,null,4,1764,"Y25_empty",5,null,"n/a",null,null,"JXAT (T)Construction Materials",null,null,1.2326999999999999,1.2649999999999999]
[null,"JXAT (T)","Unladen","Domestic Intermodal",null,null,29.171768277257783,null,4,1764,"Y25_empty",5,null,"n/a",null,null,"JXAT (T)Domestic Intermodal",null,null,1.2932999999999999,1.3642000000000001]
[null,"JXAT (L)","Laden","Domestic Waste",null,null,74.574778879656918,null,4,1764,"Y25_loaded",5,null,"n/a",null,null,"JXAT (L)Domestic Waste",null,null,2.5162,2.8073000000000001]
[null,"JXAT (T)","Unladen","Domestic Waste",null,null,28.058615049073069,null,4,1764,"Y25_empty",5,null,"n/a",null,null,"JXAT (T)Domestic Waste",null,null,1.2324999999999999,1.1633]
[null,"JXAT (L)","Laden","Industrial Minerals",null,null,95.905505661850839,null,4,1764,"Y25_loaded",5,null,"n/a",null,null,"JXAT (L)Industrial Minerals",null,null,2.8892000000000002,4.3489000000000004]
[null,"JXAT (T)","Unladen","Industrial Minerals",null,null,24,null,4,1764,"Y25_empty",5,null,"n/a",null,null,"JXAT (T)Industrial Minerals",null,null,1.1099000000000001,0.99039999999999995]
[null,"JXAT (T)","Unladen","Other",null,null,29.35,null,4,1764,"Y25_empty",5,null,"n/a",null,null,"JXAT (T)Other",null,null,1.1769000000000001,1.1960999999999999]
[null,"JXAT (L)","Laden","Steel",null,null,79.487252042289697,null,4,1764,"Y25_loaded",5,null,"n/a",null,null,"JXAT (L)Steel",null,null,2.4868999999999999,3.1608999999999998]
[null,"JXAT (T)","Unladen","Steel",null,null,29.225422338855179,null,4,1764,"Y25_empty",5,null,"n/a",null,null,"JXAT (T)Steel",null,null,1.1765000000000001,1.1950000000000001]
[null,"JYAT (L)","Laden","Construction Materials",null,null,97.897375571418578,null,4,1780,"Y25_loaded",5,null,"n/a",null,null,"JYAT (L)Construction Materials",null,null,3.0798000000000001,5.0603999999999996]
[null,"JYAT (T)","Unladen","Construction Materials",null,null,24.999251817904355,null,4,1780,"Y25_empty",5,null,"n/a",null,null,"JYAT (T)Construction Materials",null,null,1.1027,1.2673000000000001]
[null,"JZAA (L)","Laden","Enterprise",null,null,50,null,4,1344,"Y25_loaded",5,null,"n/a",null,null,"JZAA (L)Enterprise",null,null,1.7621,1.7611000000000001]
[null,"JZAA (T)","Unladen","Enterprise",null,null,40,null,4,1344,"Y25_empty",5,null,"n/a",null,null,"JZAA (T)Enterprise",null,null,1.327,1.3492]
[null,"JZAA (L)","Laden","Steel",null,null,76,null,4,1344,"Y25_loaded",5,null,"n/a",null,null,"JZAA (L)Steel",null,null,2.0226999999999999,2.9066999999999998]
[null,"JZAA (T)","Unladen","Steel",null,null,40,null,4,1344,"Y25_empty",5,null,"n/a",null,null,"JZAA (T)Steel",null,null,1.2245999999999999,1.3249]
[null,"JZAB (L)","Laden","Enterprise",null,null,41,null,4,1344,"Y25_loaded",5,null,"n/a",null,null,"JZAB (L)Enterprise",null,null,1.6561999999999999,1.5535000000000001]
[null,"JZAB (T)","Unladen","Enterprise",null,null,31,null,4,1344,"Y25_empty",5,null,"n/a",null,null,"JZAB (T)Enterprise",null,null,1.2070000000000001,1.1986000000000001]
[null,"JZAB (L)","Laden","Steel",null,null,66,null,4,1344,"Y25_loaded",5,null,"n/a",null,null,"JZAB (L)Steel",null,null,1.8045,2.3412999999999999]
[null,"JZAB (T)","Unladen","Steel",null,null,31,null,4,1344,"Y25_empty",5,null,"n/a",null,null,"JZAB (T)Steel",null,null,1.1173,1.1718]
[null,"JZAD (T)","Unladen","Enterprise",null,null,27,null,4,1344,"Y25_empty",5,null,"n/a",null,null,"JZAD (T)Enterprise",null,null,1.1675,1.1596]
[null,"JZAD (T)","Unladen","Steel",null,null,27,null,4,1344,"Y25_empty",5,null,"n/a",null,null,"JZAD (T)Steel",null,null,1.0827,1.1301000000000001]
[null,"KBAA (T)","Unladen","Other",null,null,28.57,null,4,1780,"3piece_Empty",3,null,"n/a",null,null,"KBAA (T)Other",null,null,1.3653,1.5215000000000001]
[null,"KEAZ (L)","Laden","Coal ESI",null,null,87.593639089883624,null,4,1780,"3piece_loaded",3,null,"n/a",null,null,"KEAZ (L)Coal ESI",null,null,3.2557,4.9345999999999997]
[null,"KEAZ (T)","Unladen","Coal ESI",null,null,27.532440056417492,null,4,1780,"3piece_empty",3,null,"n/a",null,null,"KEAZ (T)Coal ESI",null,null,1.3555999999999999,1.4974000000000001]
[null,"KEAZ (L)","Laden","Coal Other",null,null,82.519663276398163,null,4,1780,"3piece_loaded",3,null,"n/a",null,null,"KEAZ (L)Coal Other",null,null,3.242,4.5728]
[null,"KEAZ (T)","Unladen","Coal Other",null,null,27.519797654067229,null,4,1780,"3piece_empty",3,null,"n/a",null,null,"KEAZ (T)Coal Other",null,null,1.3638999999999999,1.5217000000000001]
[null,"KEAZ (L)","Laden","Construction Materials",null,null,94.991467576791806,null,4,1780,"3piece_loaded",3,null,"n/a",null,null,"KEAZ (L)Construction Materials",null,null,3.68,5.8642000000000003]
[null,"KEAZ (T)","Unladen","Construction Materials",null,null,27.548922470615992,null,4,1780,"3piece_empty",3,null,"n/a",null,null,"KEAZ (T)Construction Materials",null,null,1.4011,1.6189]
[null,"KEAZ (L)","Laden","Domestic Waste",null,null,73.979761397528762,null,4,1780,"3piece_loaded",3,null,"n/a",null,null,"KEAZ (L)Domestic Waste",null,null,3.2406000000000001,4.0227000000000004]
[null,"KEAZ (T)","Unladen","Domestic Waste",null,null,27.020539906103284,null,4,1780,"3piece_empty",3,null,"n/a",null,null,"KEAZ (T)Domestic Waste",null,null,1.4387000000000001,1.4979]
[null,"KEAZ (L)","Laden","Industrial Minerals",null,null,96.947656392485882,null,4,1780,"3piece_loaded",3,null,"n/a",null,null,"KEAZ (L)Industrial Minerals",null,null,3.5939000000000001,5.5972999999999997]
[null,"KEAZ (T)","Unladen","Industrial Minerals",null,null,27.850861853609796,null,4,1780,"3piece_empty",3,null,"n/a",null,null,"KEAZ (T)Industrial Minerals",null,null,1.3069,1.3534999999999999]
[null,"KEAZ (L)","Laden","Iron Ore",null,null,73.538787580088723,null,4,1780,"3piece_loaded",3,null,"n/a",null,null,"KEAZ (L)Iron Ore",null,null,2.9525999999999999,4.0263999999999998]
[null,"KEAZ (T)","Unladen","Iron Ore",null,null,27.619494000957207,null,4,1780,"3piece_empty",3,null,"n/a",null,null,"KEAZ (T)Iron Ore",null,null,1.3636999999999999,1.5216000000000001]
[null,"KEAZ (L)","Laden","Other",null,null,56.764705882352942,null,4,1780,"3piece_loaded",3,null,"n/a",null,null,"KEAZ (L)Other",null,null,2.8773,3.4849999999999999]
[null,"KEAZ (T)","Unladen","Other",null,null,27.693874902673244,null,4,1780,"3piece_empty",3,null,"n/a",null,null,"KEAZ (T)Other",null,null,1.3636999999999999,1.5215000000000001]
[null,"KEAZ (L)","Laden","Steel",null,null,86.885321718827186,null,4,1780,"3piece_loaded",3,null,"n/a",null,null,"KEAZ (L)Steel",null,null,3.3542000000000001,4.9109999999999996]
[null,"KEAZ (T)","Unladen","Steel",null,null,27.333055365686945,null,4,1780,"3piece_empty",3,null,"n/a",null,null,"KEAZ (T)Steel",null,null,1.3640000000000001,1.5219]
[null,"KFAA (L)","Laden","Construction Materials",null,null,26,null,4,1344,"Y25_loaded",5,null,"n/a",null,null,"KFAA (L)Construction Materials",null,null,1.4067000000000001,1.4712000000000001]
[null,"KFAA (T)","Unladen","Construction Materials",null,null,26,null,4,1344,"Y25_empty",5,null,"n/a",null,null,"KFAA (T)Construction Materials",null,null,1.0662,1.1833]
[null,"KFAA (T)","Unladen","Domestic Intermodal",null,null,26,null,4,1344,"Y25_empty",5,null,"n/a",null,null,"KFAA (T)Domestic Intermodal",null,null,1.1351,1.2443]
[null,"KFAF (L)","Laden","Construction Materials",null,null,56.26664825173215,null,4,1344,"Y25_loaded",5,null,"n/a",null,null,"KFAF (L)Construction Materials",null,null,1.3664000000000001,1.9924999999999999]
[null,"KFAF (T)","Unladen","Construction Materials",null,null,20.110637126737306,null,4,1344,"Y25_empty",5,null,"n/a",null,null,"KFAF (T)Construction Materials",null,null,1.0563,1.1840999999999999]
[null,"KFAF (L)","Laden","Domestic Intermodal",null,null,45.988015483418778,null,4,1344,"Y25_loaded",5,null,"n/a",null,null,"KFAF (L)Domestic Intermodal",null,null,1.4207000000000001,1.7334000000000001]
[null,"KFAF (T)","Unladen","Domestic Intermodal",null,null,20,null,4,1344,"Y25_empty",5,null,"n/a",null,null,"KFAF (T)Domestic Intermodal",null,null,1.1241000000000001,1.2612000000000001]
[null,"KFAF (L)","Laden","Domestic Waste",null,null,53.420411389444929,null,4,1344,"Y25_loaded",5,null,"n/a",null,null,"KFAF (L)Domestic Waste",null,null,1.3682000000000001,1.8241000000000001]
[null,"KFAF (T)","Unladen","Domestic Waste",null,null,20,null,4,1344,"Y25_empty",5,null,"n/a",null,null,"KFAF (T)Domestic Waste",null,null,1.0859000000000001,1.0894999999999999]
[null,"KFAF (T)","Unladen","Enterprise",null,null,20,null,4,1344,"Y25_empty",5,null,"n/a",null,null,"KFAF (T)Enterprise",null,null,1.1047,1.1467000000000001]
[null,"KFAF (T)","Unladen","European Conventional",null,null,20,null,4,1344,"Y25_empty",5,null,"n/a",null,null,"KFAF (T)European Conventional",null,null,1.1288,1.2230000000000001]
[null,"KFAF (L)","Laden","European Intermodal",null,null,42.028277634961441,null,4,1344,"Y25_loaded",5,null,"n/a",null,null,"KFAF (L)European Intermodal",null,null,1.4327000000000001,1.7108000000000001]
[null,"KFAF (T)","Unladen","European Intermodal",null,null,20,null,4,1344,"Y25_empty",5,null,"n/a",null,null,"KFAF (T)European Intermodal",null,null,1.1540999999999999,1.3567]
[null,"KFAF (T)","Unladen","Other",null,null,20.062608695652177,null,4,1344,"Y25_empty",5,null,"n/a",null,null,"KFAF (T)Other",null,null,1.0309999999999999,1.1084000000000001]
[null,"KFAF (T)","Unladen","Steel",null,null,20,null,4,1344,"Y25_empty",5,null,"n/a",null,null,"KFAF (T)Steel",null,null,1.0170999999999999,1.1086]
[null,"KFAG (L)","Laden","Enterprise",null,null,27.575835475578405,null,4,1764,"Y25_loaded",5,null,"n/a",null,null,"KFAG (L)Enterprise",null,null,1.5834999999999999,1.4972000000000001]
[null,"KFAG (T)","Unladen","Enterprise",null,null,20,null,4,1764,"Y25_empty",5,null,"n/a",null,null,"KFAG (T)Enterprise",null,null,1.1619999999999999,1.2318]
[null,"KFAG (L)","Laden","Other",null,null,28.144252123946842,null,4,1764,"Y25_loaded",5,null,"n/a",null,null,"KFAG (L)Other",null,null,1.5777000000000001,1.4517]
[null,"KFAG (T)","Unladen","Other",null,null,20,null,4,1764,"Y25_empty",5,null,"n/a",null,null,"KFAG (T)Other",null,null,1.0772999999999999,1.1726000000000001]
[null,"KFAR (L)","Laden","Construction Materials",null,null,52,null,4,1344,"Y25_loaded",5,null,"n/a",null,null,"KFAR (L)Construction Materials",null,null,1.8787,1.8474999999999999]
[null,"KFAR (T)","Unladen","Construction Materials",null,null,20,null,4,1344,"Y25_empty",5,null,"n/a",null,null,"KFAR (T)Construction Materials",null,null,1.23,1.1848000000000001]
[null,"KFAR (L)","Laden","Domestic Intermodal",null,null,45.013024933238853,null,4,1344,"Y25_loaded",5,null,"n/a",null,null,"KFAR (L)Domestic Intermodal",null,null,2.0194000000000001,1.7101999999999999]
[null,"KFAR (T)","Unladen","Domestic Intermodal",null,null,19.992267037831027,null,4,1344,"Y25_empty",5,null,"n/a",null,null,"KFAR (T)Domestic Intermodal",null,null,1.3136000000000001,1.2612000000000001]
[null,"KFAR (L)","Laden","Domestic Waste",null,null,50.384938722564783,null,4,1344,"Y25_loaded",5,null,"n/a",null,null,"KFAR (L)Domestic Waste",null,null,1.8811,1.7330000000000001]
[null,"KFAR (T)","Unladen","Domestic Waste",null,null,19.792757436560677,null,4,1344,"Y25_empty",5,null,"n/a",null,null,"KFAR (T)Domestic Waste",null,null,1.2501,1.0900000000000001]
[null,"KFAR (T)","Unladen","Enterprise",null,null,20,null,4,1344,"Y25_empty",5,null,"n/a",null,null,"KFAR (T)Enterprise",null,null,1.2750999999999999,1.1467000000000001]
[null,"KFAR (T)","Unladen","Industrial Minerals",null,null,20,null,4,1344,"Y25_empty",5,null,"n/a",null,null,"KFAR (T)Industrial Minerals",null,null,1.1196999999999999,0.97540000000000004]
[null,"KFAR (T)","Unladen","Other",null,null,20,null,4,1344,"Y25_empty",5,null,"n/a",null,null,"KFAR (T)Other",null,null,1.2108000000000001,1.1086]
[null,"KFAR (T)","Unladen","Steel",null,null,20,null,4,1344,"Y25_empty",5,null,"n/a",null,null,"KFAR (T)Steel",null,null,1.1901999999999999,1.1086]
[null,"KFAT (L)","Laden","Construction Materials",null,null,58,null,4,1344,"Y25_loaded",5,null,"n/a",null,null,"KFAT (L)Construction Materials",null,null,1.7231000000000001,2.0581]
[null,"KFAT (T)","Unladen","Construction Materials",null,null,26,null,4,1344,"Y25_empty",5,null,"n/a",null,null,"KFAT (T)Construction Materials",null,null,1.0691999999999999,1.1833]
[null,"KJAS (L)","Laden","Construction Materials",null,null,38.389728096676741,null,4,1764,"Y25_loaded",5,null,"n/a",null,null,"KJAS (L)Construction Materials",null,null,1.3183,1.5913999999999999]
[null,"KJAS (T)","Unladen","Construction Materials",null,null,39.220427562439646,null,4,1764,"Y25_empty",5,null,"n/a",null,null,"KJAS (T)Construction Materials",null,null,1.2607999999999999,1.4117999999999999]
[null,"KPAX (L)","Laden","Construction Materials",null,null,84.75133821146197,null,4,1344,"Y25_loaded",5,null,"n/a",null,null,"KPAX (L)Construction Materials",null,null,2.4171,3.6781000000000001]
[null,"KPAX (T)","Unladen","Construction Materials",null,null,23.428502249238573,null,4,1344,"Y25_empty",5,null,"n/a",null,null,"KPAX (T)Construction Materials",null,null,1.0824,1.1757]
[null,"KPAX (L)","Laden","Enterprise",null,null,90,null,4,1344,"Y25_loaded",5,null,"n/a",null,null,"KPAX (L)Enterprise",null,null,2.6877,4.0895999999999999]
[null,"KPAX (T)","Unladen","Enterprise",null,null,24,null,4,1344,"Y25_empty",5,null,"n/a",null,null,"KPAX (T)Enterprise",null,null,1.1384000000000001,1.1439999999999999]
[null,"KPAX (T)","Unladen","Other",null,null,24,null,4,1344,"Y25_empty",5,null,"n/a",null,null,"KPAX (T)Other",null,null,1.0568,1.1115999999999999]
[null,"KSAA (L)","Laden","Construction Materials",null,null,65.998622341036196,null,4,1344,"Y25_loaded",5,null,"n/a",null,null,"KSAA (L)Construction Materials",null,null,1.9674,2.4157999999999999]
[null,"KSAA (T)","Unladen","Construction Materials",null,null,31,null,4,1344,"Y25_empty",5,null,"n/a",null,null,"KSAA (T)Construction Materials",null,null,1.1031,1.2255]
[null,"KSAA (T)","Unladen","Other",null,null,31,null,4,1344,"Y25_empty",5,null,"n/a",null,null,"KSAA (T)Other",null,null,1.0831999999999999,1.1718]
[null,"KTAA (L)","Laden","Domestic Intermodal",null,null,45.210511313059179,null,4,1344,"Y25_loaded",5,null,"n/a",null,null,"KTAA (L)Domestic Intermodal",null,null,1.4491000000000001,1.7148000000000001]
[null,"KTAA (T)","Unladen","Domestic Intermodal",null,null,22.999774704390354,null,4,1344,"Y25_empty",5,null,"n/a",null,null,"KTAA (T)Domestic Intermodal",null,null,1.0875999999999999,1.2428999999999999]
[null,"KUAA (L)","Laden","Other",null,null,141,null,8,1344,"Y25_loaded",5,null,"n/a",null,null,"KUAA (L)Other",null,null,1.8008999999999999,2.4550999999999998]
[null,"KUAA (T)","Unladen","Other",null,null,66,null,8,1344,"Y25_empty",5,null,"n/a",null,null,"KUAA (T)Other",null,null,1.0543,1.0552999999999999]
[null,"KVAB (L)","Laden","Construction Materials",null,null,82.261568718186012,null,4,1202,"NACO_loaded",4,null,"n/a",null,null,"KVAB (L)Construction Materials",null,null,2.9394999999999998,4.6616]
[null,"KVAB (T)","Unladen","Construction Materials",null,null,27,null,4,1202,"NACO_empty",4,null,"n/a",null,null,"KVAB (T)Construction Materials",null,null,1.2471000000000001,1.4089]
[null,"KVAB (L)","Laden","Enterprise",null,null,85.028430629264605,null,4,1202,"NACO_loaded",4,null,"n/a",null,null,"KVAB (L)Enterprise",null,null,3.1774,4.8026999999999997]
[null,"KVAB (T)","Unladen","Enterprise",null,null,27,null,4,1202,"NACO_empty",4,null,"n/a",null,null,"KVAB (T)Enterprise",null,null,1.3105,1.3836999999999999]
[null,"KVAB (L)","Laden","Other",null,null,85.478260869565219,null,4,1202,"NACO_loaded",4,null,"n/a",null,null,"KVAB (L)Other",null,null,3.0063,4.7744999999999997]
[null,"KVAB (T)","Unladen","Other",null,null,27,null,4,1202,"NACO_empty",4,null,"n/a",null,null,"KVAB (T)Other",null,null,1.2287999999999999,1.3586]
[null,"KVAB (L)","Laden","Steel",null,null,85.961062832135042,null,4,1202,"NACO_loaded",4,null,"n/a",null,null,"KVAB (L)Steel",null,null,3.0356000000000001,4.8110999999999997]
[null,"KVAB (T)","Unladen","Steel",null,null,27,null,4,1202,"NACO_empty",4,null,"n/a",null,null,"KVAB (T)Steel",null,null,1.23,1.3586]
[null,"KWAW (L)","Laden","Other",null,null,36.062404287901991,null,4,1265,"3piece_loaded",3,null,"n/a",null,null,"KWAW (L)Other",null,null,2.8605,3.6993]
[null,"KWAW (T)","Unladen","Other",null,null,29,null,4,1265,"3piece_empty",3,null,"n/a",null,null,"KWAW (T)Other",null,null,1.3119000000000001,1.4632000000000001]
[null,"KWBW (L)","Laden","Enterprise",null,null,65,null,4,1265,"3piece_loaded",3,null,"n/a",null,null,"KWBW (L)Enterprise",null,null,2.7237,3.6850999999999998]
[null,"KWBW (T)","Unladen","Enterprise",null,null,29,null,4,1265,"3piece_empty",3,null,"n/a",null,null,"KWBW (T)Enterprise",null,null,1.3978999999999999,1.4903999999999999]
[null,"KWBW (L)","Laden","Other",null,null,38.290358361774743,null,4,1265,"3piece_loaded",3,null,"n/a",null,null,"KWBW (L)Other",null,null,2.8607,3.6072000000000002]
[null,"KWBW (T)","Unladen","Other",null,null,29,null,4,1265,"3piece_empty",3,null,"n/a",null,null,"KWBW (T)Other",null,null,1.3119000000000001,1.4632000000000001]
[null,"KXAC (L)","Laden","Other",null,null,148.75769230769231,null,8,1475,"Y25_loaded",5,null,"n/a",null,null,"KXAC (L)Other",null,null,2.0377000000000001,2.6949000000000001]
[null,"KXAC (T)","Unladen","Other",null,null,54,null,8,1475,"Y25_empty",5,null,"n/a",null,null,"KXAC (T)Other",null,null,0.98199999999999998,0.96919999999999995]
[null,"MBAB (L)","Laden","Coal ESI",null,null,90.582894914339676,null,4,2062,"NACO_loaded",4,null,"n/a",null,null,"MBAB (L)Coal ESI",null,null,3.3464,5.1839000000000004]
[null,"MBAB (T)","Unladen","Coal ESI",null,null,30,null,4,2062,"NACO_empty",4,null,"n/a",null,null,"MBAB (T)Coal ESI",null,null,1.3097000000000001,1.4357]
[null,"MBAB (L)","Laden","Coal Other",null,null,86.770831810807266,null,4,2062,"NACO_loaded",4,null,"n/a",null,null,"MBAB (L)Coal Other",null,null,3.3519999999999999,4.9055]
[null,"MBAB (T)","Unladen","Coal Other",null,null,30,null,4,2062,"NACO_empty",4,null,"n/a",null,null,"MBAB (T)Coal Other",null,null,1.321,1.4623999999999999]
[null,"MBAB (L)","Laden","Construction Materials",null,null,87.098847955731742,null,4,2062,"NACO_loaded",4,null,"n/a",null,null,"MBAB (L)Construction Materials",null,null,3.4150999999999998,5.0857999999999999]
[null,"MBAB (T)","Unladen","Construction Materials",null,null,30,null,4,2062,"NACO_empty",4,null,"n/a",null,null,"MBAB (T)Construction Materials",null,null,1.3547,1.5693999999999999]
[null,"MBAB (L)","Laden","Domestic Waste",null,null,90.532499999999999,null,4,2062,"NACO_loaded",4,null,"n/a",null,null,"MBAB (L)Domestic Waste",null,null,3.4319999999999999,5.1795]
[null,"MBAB (T)","Unladen","Domestic Waste",null,null,30,null,4,2062,"NACO_empty",4,null,"n/a",null,null,"MBAB (T)Domestic Waste",null,null,1.3985000000000001,1.4357]
[null,"MBAB (T)","Unladen","Enterprise",null,null,30,null,4,2062,"NACO_empty",4,null,"n/a",null,null,"MBAB (T)Enterprise",null,null,1.4213,1.5158]
[null,"MBAB (L)","Laden","Industrial Minerals",null,null,87.480073655136138,null,4,2062,"NACO_loaded",4,null,"n/a",null,null,"MBAB (L)Industrial Minerals",null,null,3.3666,4.7126999999999999]
[null,"MBAB (T)","Unladen","Industrial Minerals",null,null,30,null,4,2062,"NACO_empty",4,null,"n/a",null,null,"MBAB (T)Industrial Minerals",null,null,1.2557,1.276]
[null,"MBAB (T)","Unladen","Other",null,null,30,null,4,2062,"NACO_empty",4,null,"n/a",null,null,"MBAB (T)Other",null,null,1.3186,1.4623999999999999]
[null,"MBAB (L)","Laden","Steel",null,null,83.2712693869573,null,4,2062,"NACO_loaded",4,null,"n/a",null,null,"MBAB (L)Steel",null,null,3.3378000000000001,4.6475999999999997]
[null,"MBAB (T)","Unladen","Steel",null,null,30,null,4,2062,"NACO_empty",4,null,"n/a",null,null,"MBAB (T)Steel",null,null,1.3186,1.4623999999999999]
[null,"MBAC (L)","Laden","Coal ESI",null,null,90.768404083825885,null,4,2062,"NACO_loaded",4,null,"n/a",null,null,"MBAC (L)Coal ESI",null,null,3.3504,5.2003000000000004]
[null,"MBAC (T)","Unladen","Coal ESI",null,null,30,null,4,2062,"NACO_empty",4,null,"n/a",null,null,"MBAC (T)Coal ESI",null,null,1.3176000000000001,1.4357]
[null,"MBAC (L)","Laden","Coal Other",null,null,87.486575575522366,null,4,2062,"NACO_loaded",4,null,"n/a",null,null,"MBAC (L)Coal Other",null,null,3.3708999999999998,4.9622999999999999]
[null,"MBAC (T)","Unladen","Coal Other",null,null,30,null,4,2062,"NACO_empty",4,null,"n/a",null,null,"MBAC (T)Coal Other",null,null,1.3240000000000001,1.4623999999999999]
[null,"MBAC (L)","Laden","Construction Materials",null,null,87.293243200951395,null,4,2062,"NACO_loaded",4,null,"n/a",null,null,"MBAC (L)Construction Materials",null,null,3.42,5.1020000000000003]
[null,"MBAC (T)","Unladen","Construction Materials",null,null,30,null,4,2062,"NACO_empty",4,null,"n/a",null,null,"MBAC (T)Construction Materials",null,null,1.3627,1.5693999999999999]
[null,"MBAC (L)","Laden","Domestic Waste",null,null,75.040000000000006,null,4,2062,"NACO_loaded",4,null,"n/a",null,null,"MBAC (L)Domestic Waste"]
[null,"MBAC (T)","Unladen","Domestic Waste",null,null,30,null,4,2062,"NACO_empty",4,null,"n/a",null,null,"MBAC (T)Domestic Waste"]
[null,"MBAC (T)","Unladen","Enterprise",null,null,30,null,4,2062,"NACO_empty",4,null,"n/a",null,null,"MBAC (T)Enterprise",null,null,1.4303999999999999,1.5158]
[null,"MBAC (L)","Laden","Industrial Minerals",null,null,81.223527109023294,null,4,2062,"NACO_loaded",4,null,"n/a",null,null,"MBAC (L)Industrial Minerals",null,null,3.2229000000000001,4.2949999999999999]
[null,"MBAC (T)","Unladen","Industrial Minerals",null,null,30,null,4,2062,"NACO_empty",4,null,"n/a",null,null,"MBAC (T)Industrial Minerals",null,null,1.2638,1.276]
[null,"MBAC (T)","Unladen","Other",null,null,30,null,4,2062,"NACO_empty",4,null,"n/a",null,null,"MBAC (T)Other",null,null,1.3267,1.4623999999999999]
[null,"MBAC (L)","Laden","Steel",null,null,83.161531512403883,null,4,2062,"NACO_loaded",4,null,"n/a",null,null,"MBAC (L)Steel",null,null,3.3296000000000001,4.6399999999999997]
[null,"MBAC (T)","Unladen","Steel",null,null,30,null,4,2062,"NACO_empty",4,null,"n/a",null,null,"MBAC (T)Steel",null,null,1.3267,1.4623999999999999]
[null,"MCAA (L)","Laden","Construction Materials",null,null,90.5,null,4,2062,"NACO_loaded",4,null,"n/a",null,null,"MCAA (L)Construction Materials",null,null,3.5739999999999998,5.3845999999999998]
[null,"MCAA (T)","Unladen","Construction Materials",null,null,29.190889370932759,null,4,2062,"NACO_empty",4,null,"n/a",null,null,"MCAA (T)Construction Materials",null,null,1.3506,1.5696000000000001]
[null,"MCAA (T)","Unladen","Enterprise",null,null,28.470319634703195,null,4,2062,"NACO_empty",4,null,"n/a",null,null,"MCAA (T)Enterprise",null,null,1.4124000000000001,1.5148999999999999]
[null,"MCAA (T)","Unladen","Other",null,null,28.5,null,4,2062,"NACO_empty",4,null,"n/a",null,null,"MCAA (T)Other",null,null,1.3147,1.4591000000000001]
[null,"MDAA (T)","Unladen","Enterprise",null,null,28,null,4,2062,"NACO_empty",4,null,"n/a",null,null,"MDAA (T)Enterprise",null,null,1.4157,1.5155000000000001]
[null,"MDAA (T)","Unladen","Other",null,null,28,null,4,2062,"NACO_empty",4,null,"n/a",null,null,"MDAA (T)Other",null,null,1.3145,1.4589000000000001]
[null,"MEAA (L)","Laden","Coal ESI",null,null,42.00889284735544,null,2,1614,"2axle_loaded",2,null,"n/a",null,null,"MEAA (L)Coal ESI",null,null,2.6549999999999998,4.1851000000000003]
[null,"MEAA (T)","Unladen","Coal ESI",null,null,14.999981312137145,null,2,1614,"2axle_empty",2,null,"n/a",null,null,"MEAA (T)Coal ESI",null,null,1.2298,1.4895]
[null,"MEAA (L)","Laden","Coal Other",null,null,42.60379341184759,null,2,1614,"2axle_loaded",2,null,"n/a",null,null,"MEAA (L)Coal Other",null,null,2.8001999999999998,4.3308]
[null,"MEAA (T)","Unladen","Coal Other",null,null,14.983539793282825,null,2,1614,"2axle_empty",2,null,"n/a",null,null,"MEAA (T)Coal Other",null,null,1.2365999999999999,1.5098]
[null,"MEAA (L)","Laden","Construction Materials",null,null,44.41892614875232,null,2,1614,"2axle_loaded",2,null,"n/a",null,null,"MEAA (L)Construction Materials",null,null,2.9615,4.8627000000000002]
[null,"MEAA (T)","Unladen","Construction Materials",null,null,15,null,2,1614,"2axle_empty",2,null,"n/a",null,null,"MEAA (T)Construction Materials",null,null,1.2643,1.5925]
[null,"MEAA (T)","Unladen","Enterprise",null,null,15,null,2,1614,"2axle_empty",2,null,"n/a",null,null,"MEAA (T)Enterprise",null,null,1.3298000000000001,1.5511999999999999]
[null,"MEAA (L)","Laden","Industrial Minerals",null,null,39.791249370822136,null,2,1614,"2axle_loaded",2,null,"n/a",null,null,"MEAA (L)Industrial Minerals",null,null,2.5602,3.6297999999999999]
[null,"MEAA (T)","Unladen","Industrial Minerals",null,null,15,null,2,1614,"2axle_empty",2,null,"n/a",null,null,"MEAA (T)Industrial Minerals",null,null,1.1919999999999999,1.3668]
[null,"MEAA (T)","Unladen","Other",null,null,15,null,2,1614,"2axle_empty",2,null,"n/a",null,null,"MEAA (T)Other",null,null,1.2365999999999999,1.51]
[null,"MEAA (L)","Laden","Steel",null,null,36,null,2,1614,"2axle_loaded",2,null,"n/a",null,null,"MEAA (L)Steel",null,null,2.4508999999999999,3.3178000000000001]
[null,"MEAA (T)","Unladen","Steel",null,null,15,null,2,1614,"2axle_empty",2,null,"n/a",null,null,"MEAA (T)Steel",null,null,1.2366999999999999,1.51]
[null,"MFAA (L)","Laden","Construction Materials",null,null,40.666769651763254,null,2,1614,"2axle_loaded",2,null,"n/a",null,null,"MFAA (L)Construction Materials",null,null,2.7193999999999998,4.1360999999999999]
[null,"MFAA (T)","Unladen","Construction Materials",null,null,14,null,2,1614,"2axle_empty",2,null,"n/a",null,null,"MFAA (T)Construction Materials",null,null,1.2526999999999999,1.5873999999999999]
[null,"MFAA (L)","Laden","Enterprise",null,null,28.739382239382241,null,2,1614,"2axle_loaded",2,null,"n/a",null,null,"MFAA (L)Enterprise",null,null,2.3932000000000002,2.6533000000000002]
[null,"MFAA (T)","Unladen","Enterprise",null,null,14,null,2,1614,"2axle_empty",2,null,"n/a",null,null,"MFAA (T)Enterprise",null,null,1.3143,1.5439000000000001]
[null,"MFAA (L)","Laden","Other",null,null,33,null,2,1614,"2axle_loaded",2,null,"n/a",null,null,"MFAA (L)Other",null,null,2.3530000000000002,2.9802]
[null,"MFAA (T)","Unladen","Other",null,null,14,null,2,1614,"2axle_empty",2,null,"n/a",null,null,"MFAA (T)Other",null,null,1.2235,1.5004999999999999]
[null,"MHAA (L)","Laden","Construction Materials",null,null,40.543336111665468,null,2,1646,"2axle_loaded",2,null,"n/a",null,null,"MHAA (L)Construction Materials",null,null,2.8424,4.117]
[null,"MHAA (T)","Unladen","Construction Materials",null,null,14.336861828605763,null,2,1646,"2axle_empty",2,null,"n/a",null,null,"MHAA (T)Construction Materials",null,null,1.3363,1.5946]
[null,"MHAA (L)","Laden","Domestic Automotive",null,null,29.111111111111111,null,2,1646,"2axle_loaded",2,null,"n/a",null,null,"MHAA (L)Domestic Automotive",null,null,2.7374999999999998,2.6421000000000001]
[null,"MHAA (T)","Unladen","Domestic Automotive",null,null,14.29944607363962,null,2,1646,"2axle_empty",2,null,"n/a",null,null,"MHAA (T)Domestic Automotive",null,null,1.3671,1.5065]
[null,"MHAA (L)","Laden","Enterprise",null,null,31.937367303609339,null,2,1646,"2axle_loaded",2,null,"n/a",null,null,"MHAA (L)Enterprise",null,null,2.6301000000000001,2.9247000000000001]
[null,"MHAA (T)","Unladen","Enterprise",null,null,14.468173431734318,null,2,1646,"2axle_empty",2,null,"n/a",null,null,"MHAA (T)Enterprise",null,null,1.4094,1.5515000000000001]
[null,"MHAA (L)","Laden","Other",null,null,34,null,2,1646,"2axle_loaded",2,null,"n/a",null,null,"MHAA (L)Other",null,null,2.5190999999999999,3.0867]
[null,"MHAA (T)","Unladen","Other",null,null,14.391780596277385,null,2,1646,"2axle_empty",2,null,"n/a",null,null,"MHAA (T)Other",null,null,1.3069,1.5072000000000001]
[null,"MHAA (L)","Laden","Steel",null,null,37.394285714285722,null,2,1646,"2axle_loaded",2,null,"n/a",null,null,"MHAA (L)Steel",null,null,2.6701000000000001,3.5005999999999999]
[null,"MJAA (L)","Laden","Construction Materials",null,null,86.696826236723425,null,4,1300,"LN25_loaded",6,null,"n/a",null,null,"MJAA (L)Construction Materials",null,null,2.4398,3.7105000000000001]
[null,"MJAA (T)","Unladen","Construction Materials",null,null,23,null,4,1300,"LN25_empty",6,null,"n/a",null,null,"MJAA (T)Construction Materials",null,null,1.0091000000000001,1.0784]
[null,"MLAA (L)","Laden","Construction Materials",null,null,83.704619561995329,null,4,1535,"NACO_loaded",5,null,"n/a",null,null,"MLAA (L)Construction Materials",null,null,3.0491000000000001,4.6645000000000003]
[null,"MLAA (T)","Unladen","Construction Materials",null,null,24.700108765710603,null,4,1535,"NACO_empty",5,null,"n/a",null,null,"MLAA (T)Construction Materials",null,null,1.2601,1.4496]
[null,"MLAA (L)","Laden","Other",null,null,90,null,4,1535,"NACO_loaded",5,null,"n/a",null,null,"MLAA (L)Other",null,null,3.1875,5.0129000000000001]
[null,"MLAA (T)","Unladen","Other",null,null,24.281830601092896,null,4,1535,"NACO_empty",5,null,"n/a",null,null,"MLAA (T)Other",null,null,1.2456,1.3732]
[null,"MLAB (L)","Laden","Construction Materials",null,null,68.57386363636364,null,4,1535,"NACO_loaded",5,null,"n/a",null,null,"MLAB (L)Construction Materials",null,null,2.4314,3.8643999999999998]
[null,"MLAB (T)","Unladen","Construction Materials",null,null,24,null,4,1535,"NACO_empty",5,null,"n/a",null,null,"MLAB (T)Construction Materials",null,null,1.153,1.4559]
[null,"MMAA (L)","Laden","Construction Materials",null,null,100.44,null,4,1330,"LN25_Loaded",6,null,"n/a",null,null,"MMAA (L)Construction Materials",null,null,2.9954999999999998,5.1703999999999999]
[null,"MMAA (T)","Unladen","Construction Materials",null,null,24,null,4,1330,"LN25_Empty",6,null,"n/a",null,null,"MMAA (T)Construction Materials",null,null,1.026,1.0873999999999999]
[null,"MOAA (L)","Laden","Construction Materials",null,null,93.264591439688715,null,4,2062,"NACO_loaded",4,null,"n/a",null,null,"MOAA (L)Construction Materials",null,null,3.5928,5.6529999999999996]
[null,"MOAA (T)","Unladen","Construction Materials",null,null,28,null,4,2062,"NACO_empty",4,null,"n/a",null,null,"MOAA (T)Construction Materials",null,null,1.3528,1.5723]
[null,"MOAA (T)","Unladen","Enterprise",null,null,28,null,4,2062,"NACO_empty",4,null,"n/a",null,null,"MOAA (T)Enterprise",null,null,1.4157,1.5155000000000001]
[null,"MOAA (T)","Unladen","Other",null,null,28,null,4,2062,"NACO_empty",4,null,"n/a",null,null,"MOAA (T)Other",null,null,1.3145,1.4589000000000001]
[null,"MRAA (L)","Laden","Construction Materials",null,null,83.964305177111711,null,4,1535,"NACO_loaded",4,null,"n/a",null,null,"MRAA (L)Construction Materials",null,null,3.0968,4.8063000000000002]
[null,"MRAA (T)","Unladen","Construction Materials",null,null,33,null,4,1535,"NACO_empty",4,null,"n/a",null,null,"MRAA (T)Construction Materials",null,null,1.3072999999999999,1.4951000000000001]
[null,"MRAB (L)","Laden","Construction Materials",null,null,84.772582050537324,null,4,1535,"NACO_loaded",4,null,"n/a",null,null,"MRAB (L)Construction Materials",null,null,3.117,4.8676000000000004]
[null,"MRAB (T)","Unladen","Construction Materials",null,null,32,null,4,1535,"NACO_empty",4,null,"n/a",null,null,"MRAB (T)Construction Materials",null,null,1.3107,1.4874000000000001]
[null,"MRAC (L)","Laden","Construction Materials",null,null,85.38044338875693,null,4,1535,"NACO_loaded",4,null,"n/a",null,null,"MRAC (L)Construction Materials",null,null,3.1324999999999998,4.9147999999999996]
[null,"MRAC (T)","Unladen","Construction Materials",null,null,32,null,4,1535,"NACO_empty",4,null,"n/a",null,null,"MRAC (T)Construction Materials",null,null,1.3107,1.4874000000000001]
[null,"MRAD (L)","Laden","Coal ESI",null,null,90,null,4,1535,"NACO_loaded",4,null,"n/a",null,null,"MRAD (L)Coal ESI",null,null,3.1254,5.1174999999999997]
[null,"MRAD (L)","Laden","Construction Materials",null,null,77.782661782661791,null,4,1535,"NACO_loaded",4,null,"n/a",null,null,"MRAD (L)Construction Materials",null,null,2.9883000000000002,4.3939000000000004]
[null,"MRAD (T)","Unladen","Construction Materials",null,null,35,null,4,1535,"NACO_empty",4,null,"n/a",null,null,"MRAD (T)Construction Materials",null,null,1.3225,1.5149999999999999]
[null,"MRAE (L)","Laden","Coal ESI",null,null,90,null,4,1535,"NACO_loaded",4,null,"n/a",null,null,"MRAE (L)Coal ESI",null,null,3.1254,5.1174999999999997]
[null,"MRAE (L)","Laden","Construction Materials",null,null,84.703703703703709,null,4,1535,"NACO_loaded",4,null,"n/a",null,null,"MRAE (L)Construction Materials",null,null,3.1354000000000002,4.8623000000000003]
[null,"MRAE (T)","Unladen","Construction Materials",null,null,33,null,4,1535,"NACO_empty",4,null,"n/a",null,null,"MRAE (T)Construction Materials",null,null,1.3072999999999999,1.4951000000000001]
[null,"MRAF (L)","Laden","Coal ESI",null,null,90,null,4,1535,"NACO_loaded",4,null,"n/a",null,null,"MRAF (L)Coal ESI",null,null,3.1254,5.1174999999999997]
[null,"MRAF (L)","Laden","Construction Materials",null,null,80.777260638297875,null,4,1535,"NACO_loaded",4,null,"n/a",null,null,"MRAF (L)Construction Materials",null,null,3.0415999999999999,4.5815999999999999]
[null,"MRAF (T)","Unladen","Construction Materials",null,null,33,null,4,1535,"NACO_empty",4,null,"n/a",null,null,"MRAF (T)Construction Materials",null,null,1.3072999999999999,1.4951000000000001]
[null,"MTAA (L)","Laden","Construction Materials",null,null,39.406598085243495,null,2,1430,"2axle_loaded",2,null,"n/a",null,null,"MTAA (L)Construction Materials",null,null,2.6480999999999999,3.9119999999999999]
[null,"MTAA (T)","Unladen","Construction Materials",null,null,12.051248670138307,null,2,1430,"2axle_empty",2,null,"n/a",null,null,"MTAA (T)Construction Materials",null,null,1.2312000000000001,1.5595000000000001]
[null,"MTAA (L)","Laden","Enterprise",null,null,27.830470500373412,null,2,1430,"2axle_loaded",2,null,"n/a",null,null,"MTAA (L)Enterprise",null,null,2.3723000000000001,2.5747]
[null,"MTAA (T)","Unladen","Enterprise",null,null,12,null,2,1430,"2axle_empty",2,null,"n/a",null,null,"MTAA (T)Enterprise",null,null,1.2882,1.5195000000000001]
[null,"MTAA (L)","Laden","Other",null,null,32.111111111111114,null,2,1430,"2axle_loaded",2,null,"n/a",null,null,"MTAA (L)Other",null,null,2.3218999999999999,2.8832]
[null,"MTAA (T)","Unladen","Other",null,null,12.054235768713582,null,2,1430,"2axle_empty",2,null,"n/a",null,null,"MTAA (T)Other",null,null,1.2037,1.4782999999999999]
[null,"MTAA (L)","Laden","Steel",null,null,42,null,2,1430,"2axle_loaded",2,null,"n/a",null,null,"MTAA (L)Steel",null,null,2.8664000000000001,4.2133000000000003]
[null,"MTAB (L)","Laden","Enterprise",null,null,25.567567567567568,null,2,1430,"2axle_loaded",1,null,"n/a",null,null,"MTAB (L)Enterprise",null,null,2.4925999999999999,2.4977999999999998]
[null,"MTAB (T)","Unladen","Enterprise",null,null,12,null,2,1430,"2axle_empty",1,null,"n/a",null,null,"MTAB (T)Enterprise",null,null,1.3933,1.5515000000000001]
[null,"MTAB (T)","Unladen","Other",null,null,12,null,2,1430,"2axle_empty",1,null,"n/a",null,null,"MTAB (T)Other",null,null,1.2999000000000001,1.5094000000000001]
[null,"MWAA (L)","Laden","Construction Materials",null,null,95.49,null,4,1330,"LN25_Loaded","n/a",null,0.873,null,null,"MWAA (L)Construction Materials",null,null,2.6627999999999998,4.4825999999999997]
[null,"MWAA (T)","Unladen","Construction Materials",null,null,24.3,null,4,1330,"LN25_Empty","n/a",null,0.871,null,null,"MWAA (T)Construction Materials",null,null,1.0052000000000001,1.0663]
[null,"MWAA (L)","Laden","Industrial Minerals",null,null,95.49,null,4,1330,"LN25_Loaded","n/a",null,0.873,null,null,"MWAA (L)Industrial Minerals",null,null,2.5363000000000002,4.0419999999999998]
[null,"MWAA (T)","Unladen","Industrial Minerals",null,null,24.3,null,4,1330,"LN25_Empty","n/a",null,0.871,null,null,"MWAA (T)Industrial Minerals",null,null,0.95089999999999997,0.90549999999999997]
[null,"MWAB (L)","Laden","Construction Materials",null,null,101.6,null,4,1335.6,"LN25_loaded","n/a",null,0.91300000000000003,null,null,"MWAB (L)Construction Materials"]
[null,"MWAB (T)","Unladen","Construction materials",null,null,23.5,null,4,1335.6,"LN25_empty","n/a",null,0.91300000000000003,null,null,"MWAB (T)Construction materials"]
[null,"MWAB (L)","Laden","Industrial Minerals",null,null,101.6,null,4,1335.6,"LN25_loaded","n/a",null,0.91300000000000003,null,null,"MWAB (L)Industrial Minerals"]
[null,"MWAB (T)","Unladen","Industrial Minerals",null,null,23.5,null,4,1335.6,"LN25_empty","n/a",null,0.91300000000000003,null,null,"MWAB (T)Industrial Minerals"]
[null,"MWAB (L)","Laden","Iron Ore",null,null,101.6,null,4,1335.6,"LN25_loaded","n/a",null,0.91300000000000003,null,null,"MWAB (L)Iron Ore"]
[null,"MWAB (T)","Unladen","Iron ore",null,null,23.5,null,4,1335.6,"LN25_empty","n/a",null,0.91300000000000003,null,null,"MWAB (T)Iron ore"]
[null,"NOA0 (T)","Unladen","Other",null,null,30,null,4,1260,"Y25_empty",6,null,"n/a",null,null,"NOA0 (T)Other",null,null,1.1588000000000001,1.1164000000000001]
[null,"NZAH (T)","Unladen","Other",null,null,44,null,4,1260,"Y25_empty",6,null,"n/a",null,null,"NZAH (T)Other",null,null,1.1920999999999999,1.3632]
[null,"OAAC (L)","Laden","Construction Materials",null,null,41.863016539638103,null,2,1684,"2axle_loaded",2,null,"n/a",null,null,"OAAC (L)Construction Materials",null,null,2.8001,4.3558000000000003]
[null,"OAAC (T)","Unladen","Construction Materials",null,null,14,null,2,1684,"2axle_empty",2,null,"n/a",null,null,"OAAC (T)Construction Materials",null,null,1.2699,1.6016999999999999]
[null,"OAAF (L)","Laden","Construction Materials",null,null,41.874918130612599,null,2,1684,"2axle_loaded",2,null,"n/a",null,null,"OAAF (L)Construction Materials",null,null,2.8754,4.3579999999999997]
[null,"OAAF (T)","Unladen","Construction Materials",null,null,14,null,2,1684,"2axle_empty",2,null,"n/a",null,null,"OAAF (T)Construction Materials",null,null,1.3170999999999999,1.6016999999999999]
[null,"OAAF (L)","Laden","Enterprise",null,null,46,null,2,1684,"2axle_loaded",2,null,"n/a",null,null,"OAAF (L)Enterprise",null,null,3.2808999999999999,5.1228999999999996]
[null,"OAAF (T)","Unladen","Enterprise",null,null,14,null,2,1684,"2axle_empty",2,null,"n/a",null,null,"OAAF (T)Enterprise",null,null,1.3854,1.5553999999999999]
[null,"OAAF (T)","Unladen","Other",null,null,14,null,2,1684,"2axle_empty",2,null,"n/a",null,null,"OAAF (T)Other",null,null,1.2853000000000001,1.5091000000000001]
[null,"OBAM (L)","Laden","Construction Materials",null,null,41.639558924879395,null,2,1684,"2axle_loaded",2,null,"n/a",null,null,"OBAM (L)Construction Materials",null,null,2.8163999999999998,4.3144999999999998]
[null,"OBAM (T)","Unladen","Construction Materials",null,null,14.636764705882355,null,2,1684,"2axle_empty",2,null,"n/a",null,null,"OBAM (T)Construction Materials",null,null,1.2682,1.6033999999999999]
[null,"OBAM (L)","Laden","Enterprise",null,null,46,null,2,1684,"2axle_loaded",2,null,"n/a",null,null,"OBAM (L)Enterprise",null,null,3.2189000000000001,5.1228999999999996]
[null,"OBAM (T)","Unladen","Enterprise",null,null,14.667582417582418,null,2,1684,"2axle_empty",2,null,"n/a",null,null,"OBAM (T)Enterprise",null,null,1.3321000000000001,1.5589]
[null,"OBAM (T)","Unladen","Other",null,null,14.531380753138077,null,2,1684,"2axle_empty",2,null,"n/a",null,null,"OBAM (T)Other",null,null,1.2383999999999999,1.5129999999999999]
[null,"OCAN (L)","Laden","Construction Materials",null,null,39.417483660130721,null,2,1684,"2axle_loaded",2,null,"n/a",null,null,"OCAN (L)Construction Materials",null,null,2.8090999999999999,3.9321999999999999]
[null,"OCAN (T)","Unladen","Construction Materials",null,null,14,null,2,1684,"2axle_empty",2,null,"n/a",null,null,"OCAN (T)Construction Materials",null,null,1.3445,1.6016999999999999]
[null,"OCAN (L)","Laden","Enterprise",null,null,36.52980132450331,null,2,1684,"2axle_loaded",2,null,"n/a",null,null,"OCAN (L)Enterprise",null,null,2.7885,3.4462999999999999]
[null,"OCAN (T)","Unladen","Enterprise",null,null,14.057426702204991,null,2,1684,"2axle_empty",2,null,"n/a",null,null,"OCAN (T)Enterprise",null,null,1.4174,1.5555000000000001]
[null,"OCAN (L)","Laden","Other",null,null,19.152760351317443,null,2,1684,"2axle_loaded",2,null,"n/a",null,null,"OCAN (L)Other",null,null,2.2544,2.2441]
[null,"OCAN (T)","Unladen","Other",null,null,14.043239237201893,null,2,1684,"2axle_empty",2,null,"n/a",null,null,"OCAN (T)Other",null,null,1.3136000000000001,1.5094000000000001]
[null,"OCAN (T)","Unladen","Steel",null,null,14,null,2,1684,"2axle_empty",2,null,"n/a",null,null,"OCAN (T)Steel",null,null,1.3140000000000001,1.5091000000000001]
[null,"PAAS (L)","Laden","Construction Materials",null,null,48.255317041601259,null,2,1491,"2axle_loaded",1,null,"n/a",null,null,"PAAS (L)Construction Materials",null,null,3.6415999999999999,5.9396000000000004]
[null,"PAAS (T)","Unladen","Construction Materials",null,null,13.243941916524795,null,2,1491,"2axle_empty",1,null,"n/a",null,null,"PAAS (T)Construction Materials",null,null,1.3357000000000001,1.5984]
[null,"PAAS (L)","Laden","Industrial Minerals",null,null,50.895000000000003,null,2,1491,"2axle_Loaded",1,null,"n/a",null,null,"PAAS (L)Industrial Minerals",null,null,3.6777000000000002,6.0746000000000002]
[null,"PAAS (T)","Unladen","Industrial Minerals",null,null,13.2439,null,2,1491,"2axle_Empty",1,null,"n/a",null,null,"PAAS (T)Industrial Minerals",null,null,1.2479,1.3704000000000001]
[null,"PCAC (L)","Laden","Construction Materials",null,null,48.787702154934301,null,2,1685,"2axle_loaded",1,null,"n/a",null,null,"PCAC (L)Construction Materials",null,null,3.6943000000000001,6.0990000000000002]
[null,"PCAC (T)","Unladen","Construction Materials",null,null,13.2465996652715,null,2,1685,"2axle_empty",1,null,"n/a",null,null,"PCAC (T)Construction Materials",null,null,1.3443000000000001,1.6417999999999999]
[null,"PCAC (L)","Laden","Enterprise",null,null,41.597871711498676,null,2,1685,"2axle_loaded",1,null,"n/a",null,null,"PCAC (L)Enterprise",null,null,3.3258999999999999,4.3494999999999999]
[null,"PCAC (T)","Unladen","Enterprise",null,null,13.989513948427094,null,2,1685,"2axle_empty",1,null,"n/a",null,null,"PCAC (T)Enterprise",null,null,1.409,1.5922000000000001]
[null,"PCAC (T)","Unladen","Other",null,null,13,null,2,1685,"2axle_empty",1,null,"n/a",null,null,"PCAC (T)Other",null,null,1.3032999999999999,1.5414000000000001]
[null,"PCAC (L)","Laden","Steel",null,null,42.792803835049298,null,2,1685,"2axle_loaded",1,null,"n/a",null,null,"PCAC (L)Steel",null,null,3.1717,4.4962]
[null,"PCAC (T)","Unladen","Steel",null,null,12.889449005273251,null,2,1685,"2axle_empty",1,null,"n/a",null,null,"PCAC (T)Steel",null,null,1.3121,1.5416000000000001]
[null,"PCAE (L)","Laden","Industrial Minerals",null,null,43.821599999999997,null,2,1780,"2axle_loaded",1,null,"n/a","No. of Axles should be 2 not 4. Changed to 2 - 22.09.23",null,"PCAE (L)Industrial Minerals"]
[null,"PCAE (T)","Unladen","Industrial Minerals",null,null,14,null,2,1780,"2axle_empty",1,null,"n/a","No. of Axles should be 2 not 4. Changed to 2 - 22.09.23",null,"PCAE (T)Industrial Minerals"]
[null,"PCAE (L)","Laden","Other",null,null,43.821599999999997,null,2,1780,"2axle_loaded",1,null,"n/a","No. of Axles should be 2 not 4. Changed to 2 - 22.09.23",null,"PCAE (L)Other"]
[null,"PCAE (T)","Unladen","Other",null,null,14,null,2,1780,"2axle_empty",1,null,"n/a","No. of Axles should be 2 not 4. Changed to 2 - 22.09.23",null,"PCAE (T)Other"]
[null,"PCAE (L)","Laden","Steel",null,null,43.821616588887096,null,2,1780,"2axle_loaded",1,null,"n/a",null,null,"PCAE (L)Steel",null,null,3.0186000000000002,4.7047999999999996]
[null,"PCAE (T)","Unladen","Steel",null,null,14,null,2,1780,"2axle_empty",1,null,"n/a",null,null,"PCAE (T)Steel",null,null,1.3407,1.5564]
[null,"PFAC (L)","Laden","Other",null,null,24.012473770109583,null,2,1495,"2axle_loaded",1,null,"n/a",null,null,"PFAC (L)Other",null,null,2.1463999999999999,2.3940999999999999]
[null,"PFAC (T)","Unladen","Other",null,null,11,null,2,1495,"2axle_empty",1,null,"n/a",null,null,"PFAC (T)Other",null,null,1.2094,1.5327999999999999]
[null,"PGAC (L)","Laden","Construction Materials",null,null,46.855714052607986,null,2,1491,"2axle_loaded",1,null,"n/a",null,null,"PGAC (L)Construction Materials",null,null,3.1501999999999999,5.5712000000000002]
[null,"PGAC (T)","Unladen","Construction Materials",null,null,13.243172586210317,null,2,1491,"2axle_empty",1,null,"n/a",null,null,"PGAC (T)Construction Materials",null,null,1.3306,1.5984]
[null,"PGAC (T)","Unladen","Enterprise",null,null,13.272511848341232,null,2,1491,"2axle_empty",1,null,"n/a",null,null,"PGAC (T)Enterprise",null,null,1.4049,1.5568]
[null,"PGAC (T)","Unladen","Other",null,null,13.474485228290062,null,2,1491,"2axle_empty",1,null,"n/a",null,null,"PGAC (T)Other",null,null,1.3055000000000001,1.516]
[null,"PNAA (L)","Laden","Construction Materials",null,null,45,null,2,1684,"2axle_loaded",1,null,"n/a",null,null,"PNAA (L)Construction Materials",null,null,3.0798999999999999,5.1367000000000003]
[null,"PNAA (T)","Unladen","Construction Materials",null,null,14,null,2,1684,"2axle_empty",1,null,"n/a",null,null,"PNAA (T)Construction Materials",null,null,1.3003,1.64]
[null,"PNAE (L)","Laden","Construction Materials",null,null,45,null,2,1684,"2axle_loaded",1,null,"n/a",null,null,"PNAE (L)Construction Materials",null,null,3.0798000000000001,5.1367000000000003]
[null,"PNAE (T)","Unladen","Construction Materials",null,null,14.687633415461953,null,2,1684,"2axle_empty",1,null,"n/a",null,null,"PNAE (T)Construction Materials",null,null,1.3076000000000001,1.643]
[null,"QPAC (T)","Unladen","Other",null,null,34,null,4,1764,"Y25_empty",5,null,"n/a",null,null,"QPAC (T)Other",null,null,1.1617999999999999,1.2519]
[null,"QQAA (T)","Unladen","Other",null,null,31.696428571428569,null,4,1764,"Y25_empty",5,null,"n/a",null,null,"QQAA (T)Other",null,null,1.1587000000000001,1.2213000000000001]
[null,"QQAC (T)","Unladen","Other",null,null,40.089285714285715,null,4,1764,"Y25_empty",5,null,"n/a",null,null,"QQAC (T)Other",null,null,1.2366999999999999,1.3587]
[null,"QSAB (T)","Unladen","Other",null,null,32.513391770148523,null,4,1764,"Y25_empty",5,null,"n/a",null,null,"QSAB (T)Other",null,null,1.1778999999999999,1.2315]
[null,"QXAJ (T)","Unladen","Other",null,null,35.929078014184391,null,4,1765,"Y25_empty",5,null,"n/a",null,null,"QXAJ (T)Other",null,null,1.1744000000000001,1.2818000000000001]
[null,"RRAO (T)","Unladen","Construction Materials",null,null,12,null,2,1684,"2axle_empty",2,null,"n/a",null,null,"RRAO (T)Construction Materials",null,null,1.3203,1.6206]
[null,"RRAO (T)","Unladen","Other",null,null,12,null,2,1684,"2axle_empty",2,null,"n/a",null,null,"RRAO (T)Other",null,null,1.2847,1.5152000000000001]
[null,"RRAO (L)","Laden","Steel",null,null,12,null,2,1684,"2axle_loaded",2,null,"n/a",null,null,"RRAO (L)Steel",null,null,1.8166,2.5089000000000001]
[null,"RRAO (T)","Unladen","Steel",null,null,12,null,2,1684,"2axle_empty",2,null,"n/a",null,null,"RRAO (T)Steel",null,null,1.2847,1.5152000000000001]
[null,"RRAS (L)","Laden","Steel",null,null,14,null,2,1684,"2axle_loaded",2,null,"n/a",null,null,"RRAS (L)Steel",null,null,1.7383999999999999,2.3609]
[null,"RRAS (T)","Unladen","Steel",null,null,14,null,2,1684,"2axle_empty",2,null,"n/a",null,null,"RRAS (T)Steel",null,null,1.2919,1.5091000000000001]
[null,"RRAV (T)","Unladen","Other",null,null,16,null,2,1383,"2axle_empty",2,null,"n/a",null,null,"RRAV (T)Other",null,null,1.3261000000000001,1.5014000000000001]
[null,"RRAV (L)","Laden","Steel",null,null,16,null,2,1383,"2axle_loaded",2,null,"n/a",null,null,"RRAV (L)Steel",null,null,1.7013,2.2467000000000001]
[null,"RRAV (T)","Unladen","Steel",null,null,16,null,2,1383,"2axle_empty",2,null,"n/a",null,null,"RRAV (T)Steel",null,null,1.3261000000000001,1.5014000000000001]
[null,"RRAX (L)","Laden","Steel",null,null,20,null,2,1344,"Y25_loaded",5,null,"n/a",null,null,"RRAX (L)Steel",null,null,1.5596000000000001,1.9455]
[null,"RRAX (T)","Unladen","Steel",null,null,20,null,2,1344,"Y25_empty",5,null,"n/a",null,null,"RRAX (T)Steel",null,null,1.3072999999999999,1.5711999999999999]
[null,"SEAB (L)","Laden","Steel",null,null,42.506810465348515,null,2,1684,"2axle_loaded",2,null,"n/a",null,null,"SEAB (L)Steel",null,null,2.8637999999999999,4.3156999999999996]
[null,"SEAB (T)","Unladen","Steel",null,null,16,null,2,1684,"2axle_empty",2,null,"n/a",null,null,"SEAB (T)Steel",null,null,1.3018000000000001,1.5337000000000001]
[null,"SPAE (L)","Laden","Construction Materials",null,null,44.550561797752813,null,2,1684,"2axle_loaded",2,null,"n/a",null,null,"SPAE (L)Construction Materials",null,null,3.0733000000000001,4.8956]
[null,"SPAE (T)","Unladen","Construction Materials",null,null,15,null,2,1684,"2axle_empty",2,null,"n/a",null,null,"SPAE (T)Construction Materials",null,null,1.3484,1.6059000000000001]
[null,"SPAE (T)","Unladen","Other",null,null,15,null,2,1684,"2axle_empty",2,null,"n/a",null,null,"SPAE (T)Other",null,null,1.319,1.5181]
[null,"SPAE (L)","Laden","Steel",null,null,43.801034903733793,null,2,1684,"2axle_loaded",2,null,"n/a",null,null,"SPAE (L)Steel",null,null,2.9771000000000001,4.5631000000000004]
[null,"SPAE (T)","Unladen","Steel",null,null,15,null,2,1684,"2axle_empty",2,null,"n/a",null,null,"SPAE (T)Steel",null,null,1.319,1.5181]
[null,"SPAL (T)","Unladen","Other",null,null,16,null,2,1684,"2axle_empty",2,null,"n/a",null,null,"SPAL (T)Other",null,null,1.3372999999999999,1.5337000000000001]
[null,"SPAL (L)","Laden","Steel",null,null,41.516035591577833,null,2,1684,"2axle_loaded",2,null,"n/a",null,null,"SPAL (L)Steel",null,null,2.8458999999999999,4.1383000000000001]
[null,"SPAL (T)","Unladen","Steel",null,null,16,null,2,1684,"2axle_empty",2,null,"n/a",null,null,"SPAL (T)Steel",null,null,1.3372999999999999,1.5337000000000001]
[null,"SSAA (L)","Laden","Coal Other",null,null,44.544633586864663,null,2,1780,"2axle_loaded",1,null,"n/a",null,null,"SSAA (L)Coal Other",null,null,3.3016000000000001,4.8559000000000001]
[null,"SSAA (T)","Unladen","Coal Other",null,null,15.66666666666667,null,2,1780,"2axle_empty",1,null,"n/a",null,null,"SSAA (T)Coal Other",null,null,1.3671,1.5764]
[null,"SSAA (L)","Laden","Steel",null,null,43.931981876608262,null,2,1780,"2axle_loaded",1,null,"n/a",null,null,"SSAA (L)Steel",null,null,3.3123999999999998,4.7275]
[null,"SSAA (T)","Unladen","Steel",null,null,15.719939520576487,null,2,1780,"2axle_empty",1,null,"n/a",null,null,"SSAA (T)Steel",null,null,1.3661000000000001,1.5773999999999999]
[null,"TDAD (L)","Laden","Chemicals",null,null,26.95,null,4,1344,"Y25_loaded",5,null,"n/a",null,null,"TDAD (L)Chemicals",null,null,1.5964,1.2757000000000001]
[null,"TDAD (L)","Laden","Enterprise",null,null,25.099876186545604,null,4,1344,"Y25_loaded",5,null,"n/a",null,null,"TDAD (L)Enterprise",null,null,1.9649000000000001,1.4463999999999999]
[null,"TDAD (T)","Unladen","Enterprise",null,null,25,null,4,1344,"Y25_empty",5,null,"n/a",null,null,"TDAD (T)Enterprise",null,null,1.1228,1.1476999999999999]
[null,"TDAD (L)","Laden","Other",null,null,25.010714285714286,null,4,1344,"Y25_loaded",5,null,"n/a",null,null,"TDAD (L)Other",null,null,1.8304,1.4157999999999999]
[null,"TDAD (T)","Unladen","Other",null,null,25,null,4,1344,"Y25_empty",5,null,"n/a",null,null,"TDAD (T)Other",null,null,1.0337000000000001,1.1164000000000001]
[null,"TDAD (L)","Laden","Petroleum",null,null,57.810155695960177,null,4,1344,"Y25_loaded",5,null,"n/a",null,null,"TDAD (L)Petroleum",null,null,1.8594999999999999,1.9607000000000001]
[null,"TDAD (T)","Unladen","Petroleum",null,null,25,null,4,1344,"Y25_empty",5,null,"n/a",null,null,"TDAD (T)Petroleum",null,null,0.92479999999999996,1.0851999999999999]
[null,"TEAK (L)","Laden","Chemicals",null,null,65.409604519774007,null,4,1780,"3piece_loaded",3,null,"n/a",null,null,"TEAK (L)Chemicals",null,null,2.4638,3.5022000000000002]
[null,"TEAK (L)","Laden","Enterprise",null,null,69.519982388403449,null,4,1780,"3piece_loaded",3,null,"n/a",null,null,"TEAK (L)Enterprise",null,null,2.7961,3.89]
[null,"TEAK (T)","Unladen","Enterprise",null,null,27,null,4,1780,"3piece_empty",3,null,"n/a",null,null,"TEAK (T)Enterprise",null,null,1.4648000000000001,1.5720000000000001]
[null,"TEAK (L)","Laden","Other",null,null,28.471650500749156,null,4,1780,"3piece_loaded",3,null,"n/a",null,null,"TEAK (L)Other",null,null,3.3622000000000001,4.2725]
[null,"TEAK (L)","Laden","Petroleum",null,null,63.47799532455069,null,4,1780,"3piece_loaded",3,null,"n/a",null,null,"TEAK (L)Petroleum",null,null,2.5537000000000001,3.5876999999999999]
[null,"TEAK (T)","Unladen","Petroleum",null,null,27.959314775160596,null,4,1780,"3piece_empty",3,null,"n/a",null,null,"TEAK (T)Petroleum",null,null,1.3442000000000001,1.4734]
[null,"TEAL (L)","Laden","Chemicals",null,null,59.90411373984324,null,4,1343,"LN25_loaded",6,null,"n/a",null,null,"TEAL (L)Chemicals",null,null,1.4689000000000001,1.8627]
[null,"TEAL (L)","Laden","Enterprise",null,null,61.35,null,4,1343,"LN25_loaded",6,null,"n/a",null,null,"TEAL (L)Enterprise",null,null,1.6104000000000001,2.0813000000000001]
[null,"TEAL (L)","Laden","Other",null,null,61.35,null,4,1343,"LN25_loaded",6,null,"n/a",null,null,"TEAL (L)Other",null,null,1.5270999999999999,2.0491999999999999]
[null,"TEAL (T)","Unladen","Other",null,null,26,null,4,1343,"LN25_empty",6,null,"n/a",null,null,"TEAL (T)Other",null,null,1.0119,1.0414000000000001]
[null,"TEAL (L)","Laden","Petroleum",null,null,62.779200900693752,null,4,1343,"LN25_loaded",6,null,"n/a",null,null,"TEAL (L)Petroleum",null,null,1.5367,2.0762]
[null,"TEAM (L)","Laden","Other",null,null,25,null,4,1343,"LN25_loaded",6,null,"n/a",null,null,"TEAM (L)Other",null,null,1.3048999999999999,1.3619000000000001]
[null,"TEAM (L)","Laden","Petroleum",null,null,62.201125217279987,null,4,1343,"LN25_loaded",6,null,"n/a",null,null,"TEAM (L)Petroleum",null,null,1.5246,2.0522999999999998]
[null,"TEAP (L)","Laden","Chemicals",null,null,26.007999999999999,null,4,1325,"LN25_loaded",6,null,"n/a",null,null,"TEAP (L)Chemicals",null,null,1.2585,1.2276]
[null,"TEAP (L)","Laden","Other",null,null,26.127134724857683,null,4,1325,"LN25_loaded",6,null,"n/a",null,null,"TEAP (L)Other",null,null,1.3010999999999999,1.3541000000000001]
[null,"TEAP (L)","Laden","Petroleum",null,null,62.561034573674689,null,4,1325,"LN25_loaded",6,null,"n/a",null,null,"TEAP (L)Petroleum",null,null,1.5283,2.0665]
[null,"TEAS (L)","Laden","Enterprise",null,null,89.819726713807711,null,4,1780,"3piece_loaded",3,null,"n/a",null,null,"TEAS (L)Enterprise",null,null,3.6501000000000001,5.2462]
[null,"TEAS (T)","Unladen","Enterprise",null,null,22.000128052684534,null,4,1780,"3piece_empty",3,null,"n/a",null,null,"TEAS (T)Enterprise",null,null,1.4823999999999999,1.6246]
[null,"TEAS (T)","Unladen","European Conventional",null,null,22,null,4,1780,"3piece_empty",3,null,"n/a",null,null,"TEAS (T)European Conventional",null,null,1.5096000000000001,1.7436]
[null,"TEAS (L)","Laden","Industrial Minerals",null,null,89.8,null,4,1780,"3piece_loaded",3,null,"n/a",null,null,"TEAS (L)Industrial Minerals"]
[null,"TEAS (T)","Unladen","Industrial Minerals",null,null,21.7,null,4,1780,"3piece_empty",3,null,"n/a",null,null,"TEAS (T)Industrial Minerals"]
[null,"TEAS (T)","Unladen","Other",null,null,22,null,4,1780,"3piece_empty",3,null,"n/a",null,null,"TEAS (T)Other",null,null,1.3874,1.5650999999999999]
[null,"TEAS (L)","Laden","Petroleum",null,null,90,null,4,1780,"3piece_loaded",3,null,"n/a",null,null,"TEAS (L)Petroleum",null,null,3.4586999999999999,5.1081000000000003]
[null,"TEAS (T)","Unladen","Petroleum",null,null,22,null,4,1780,"3piece_empty",3,null,"n/a",null,null,"TEAS (T)Petroleum",null,null,1.3541000000000001,1.5057]
[null,"TIAY (L)","Laden","Petroleum",null,null,53.94600742117062,null,4,1344,"Y25_loaded",5,null,"n/a",null,null,"TIAY (L)Petroleum",null,null,1.8608,1.8274999999999999]
[null,"TIAY (T)","Unladen","Petroleum",null,null,25,null,4,1344,"Y25_empty",5,null,"n/a",null,null,"TIAY (T)Petroleum",null,null,1.0576000000000001,1.0851999999999999]
[null,"TTAA (L)","Laden","Enterprise",null,null,28.744927468902802,null,2,1430,"2axle_loaded",1,null,"n/a",null,null,"TTAA (L)Enterprise",null,null,2.4685999999999999,2.7059000000000002]
[null,"TTAA (L)","Laden","Other",null,null,26.691382634890793,null,2,1430,"2axle_loaded",1,null,"n/a",null,null,"TTAA (L)Other",null,null,2.3401000000000001,2.5289999999999999]
[null,"TTAA (L)","Laden","Petroleum",null,null,27.685982711271407,null,2,1430,"2axle_loaded",1,null,"n/a",null,null,"TTAA (L)Petroleum",null,null,2.274,2.5581999999999998]
[null,"TUAC (L)","Laden","Chemicals",null,null,26.985212569316083,null,2,1780,"2axle_loaded",1,null,"n/a",null,null,"TUAC (L)Chemicals",null,null,2.7389000000000001,2.3883999999999999]
[null,"TUAC (L)","Laden","Other",null,null,22.371332209106239,null,2,1780,"2axle_loaded",1,null,"n/a",null,null,"TUAC (L)Other",null,null,2.5728,2.3555999999999999]
[null,"TUAC (T)","Unladen","Other",null,null,15,null,2,1780,"2axle_empty",1,null,"n/a",null,null,"TUAC (T)Other",null,null,1.3495999999999999,1.5661]
[null,"VGAF (L)","Laden","Domestic Automotive",null,null,20.460076045627378,null,2,1684,"2axle_loaded",2,null,"n/a",null,null,"VGAF (L)Domestic Automotive",null,null,2.4489999999999998,2.2561]
[null,"VGAF (T)","Unladen","Domestic Automotive",null,null,18,null,2,1684,"2axle_empty",2,null,"n/a",null,null,"VGAF (T)Domestic Automotive",null,null,1.3411999999999999,1.583]
[null,"VGAF (L)","Laden","Enterprise",null,null,28.835343471421083,null,2,1684,"2axle_loaded",2,null,"n/a",null,null,"VGAF (L)Enterprise",null,null,2.4274,2.6659000000000002]
[null,"VGAF (T)","Unladen","Enterprise",null,null,18,null,2,1684,"2axle_empty",2,null,"n/a",null,null,"VGAF (T)Enterprise",null,null,1.3725000000000001,1.6221000000000001]
[null,"VGAF (L)","Laden","European Conventional",null,null,23,null,2,1684,"2axle_loaded",2,null,"n/a",null,null,"VGAF (L)European Conventional",null,null,2.3180999999999998,2.4293]
[null,"VGAF (T)","Unladen","European Conventional",null,null,18,null,2,1684,"2axle_empty",2,null,"n/a",null,null,"VGAF (T)European Conventional",null,null,1.3986000000000001,1.7009000000000001]
[null,"VGAF (L)","Laden","Industrial Minerals",null,null,21,null,2,1684,"2axle_loaded",2,null,"n/a",null,null,"VGAF (L)Industrial Minerals",null,null,2.0699000000000001,2.1377000000000002]
[null,"VGAF (T)","Unladen","Industrial Minerals",null,null,18,null,2,1684,"2axle_empty",2,null,"n/a",null,null,"VGAF (T)Industrial Minerals",null,null,1.2387999999999999,1.4478]
[null,"VGAF (L)","Laden","Other",null,null,30.733684005454897,null,2,1684,"2axle_loaded",2,null,"n/a",null,null,"VGAF (L)Other",null,null,2.3431999999999999,2.7732000000000001]
[null,"VGAF (T)","Unladen","Other",null,null,17.999907569303765,null,2,1684,"2axle_empty",2,null,"n/a",null,null,"VGAF (T)Other",null,null,1.2743,1.583]
[null,"VGAF (L)","Laden","Steel",null,null,29.6,null,2,1684,"2axle_loaded",2,null,"n/a",null,null,"VGAF (L)Steel"]
[null,"VGAF (T)","Unladen","Steel",null,null,18,null,2,1684,"2axle_empty",2,null,"n/a",null,null,"VGAF (T)Steel"]
[null,"VKAA (L)","Laden","Enterprise",null,null,29.128853939582687,null,2,1684,"2axle_loaded",2,null,"n/a",null,null,"VKAA (L)Enterprise",null,null,1.7584,2.6877]
[null,"VKAA (T)","Unladen","Enterprise",null,null,18,null,2,1684,"2axle_empty",2,null,"n/a",null,null,"VKAA (T)Enterprise",null,null,1.4657,1.6221000000000001]
[null,"VKAA (L)","Laden","Other",null,null,31.317920591689365,null,2,1684,"2axle_loaded",2,null,"n/a",null,null,"VKAA (L)Other",null,null,1.7931999999999999,2.8239999999999998]
[null,"VKAA (T)","Unladen","Other",null,null,18,null,2,1684,"2axle_empty",2,null,"n/a",null,null,"VKAA (T)Other",null,null,1.3557999999999999,1.583]
[null,"VXAD (T)","Unladen","Other",null,null,25,null,2,1684,"2axle_empty",2,null,"n/a",null,null,"VXAD (T)Other",null,null,1.5801000000000001,1.9197]
[null,"WIAA (L)","Laden","Domestic Automotive",null,null,131.83120379594192,null,12,1347,"Y25_loaded",5,null,"n/a",null,null,"WIAA (L)Domestic Automotive",null,null,1.3979999999999999,1.3290999999999999]
[null,"WIAA (T)","Unladen","Domestic Automotive",null,null,95.945499992005679,null,12,1347,"Y25_empty",5,null,"n/a",null,null,"WIAA (T)Domestic Automotive",null,null,1.1121000000000001,0.98719999999999997]
[null,"WIAA (L)","Laden","Enterprise",null,null,131.34228571428571,null,12,1347,"Y25_loaded",5,null,"n/a",null,null,"WIAA (L)Enterprise",null,null,1.3334999999999999,1.3492999999999999]
[null,"WIAA (T)","Unladen","Enterprise",null,null,96.067041725269576,null,12,1347,"Y25_empty",5,null,"n/a",null,null,"WIAA (T)Enterprise",null,null,1.1480999999999999,1.0144]
[null,"WIAA (T)","Unladen","Other",null,null,95.889735495809305,null,12,1347,"Y25_empty",5,null,"n/a",null,null,"WIAA (T)Other",null,null,1.0565,0.98680000000000001]
[null,"YDAC (T)","Unladen","Other",null,null,26,null,4,1344,"Y25_empty",5,null,"n/a",null,null,"YDAC (T)Other",null,null,1.0757000000000001,1.1226]
[null,"YDAE (L)","Laden","Steel",null,null,80,null,4,1764,"Y25_loaded",5,null,"n/a",null,null,"YDAE (L)Steel",null,null,2.1413000000000002,3.1978]
[null,"YDAE (T)","Unladen","Steel",null,null,32,null,4,1764,"Y25_empty",5,null,"n/a",null,null,"YDAE (T)Steel",null,null,1.135,1.2250000000000001]
[null,"YDAF (L)","Laden","Steel",null,null,80,null,4,1764,"Y25_loaded",5,null,"n/a",null,null,"YDAF (L)Steel",null,null,2.1413000000000002,3.1978]
[null,"YDAF (T)","Unladen","Steel",null,null,32,null,4,1764,"Y25_empty",5,null,"n/a",null,null,"YDAF (T)Steel",null,null,1.141,1.2250000000000001]
[null,"YDAG (T)","Unladen","Construction Materials",null,null,32,null,4,1764,"Y25_empty",5,null,"n/a",null,null,"YDAG (T)Construction Materials",null,null,1.1294999999999999,1.304]
[null,"YEAA (L)","Laden","Construction Materials",null,null,66.240993788819878,null,4,1344,"Y25_loaded",5,null,"n/a",null,null,"YEAA (L)Construction Materials",null,null,1.6160000000000001,2.4281000000000001]
[null,"YEAA (T)","Unladen","Construction Materials",null,null,30.177509293680302,null,4,1344,"Y25_empty",5,null,"n/a",null,null,"YEAA (T)Construction Materials",null,null,1.1358999999999999,1.2163999999999999]
[null,"YEAA (T)","Unladen","Other",null,null,30,null,4,1344,"Y25_empty",5,null,"n/a",null,null,"YEAA (T)Other",null,null,1.1162000000000001,1.1597999999999999]
[null,"YEAD (T)","Unladen","Construction Materials",null,null,40,null,4,1344,"Y25_empty",5,null,"n/a",null,null,"YEAD (T)Construction Materials",null,null,1.2387999999999999,1.3737999999999999]
[null,"YEAD (T)","Unladen","Enterprise",null,null,40,null,4,1344,"Y25_empty",5,null,"n/a",null,null,"YEAD (T)Enterprise",null,null,1.3248,1.3492]
[null,"YEAD (T)","Unladen","Steel",null,null,40,null,4,1344,"Y25_empty",5,null,"n/a",null,null,"YEAD (T)Steel",null,null,1.2231000000000001,1.3249]
[null,"YGAA (L)","Laden","Construction Materials",null,null,54.390633608815428,null,4,1764,"Y25_loaded",5,null,"n/a",null,null,"YGAA (L)Construction Materials",null,null,1.5758000000000001,1.9649000000000001]
[null,"YGAA (T)","Unladen","Construction Materials",null,null,21.136308805790112,null,4,1764,"Y25_empty",5,null,"n/a",null,null,"YGAA (T)Construction Materials",null,null,1.1247,1.2795000000000001]
[null,"YGAA (L)","Laden","Other",null,null,52.154375614552613,null,4,1764,"Y25_loaded",5,null,"n/a",null,null,"YGAA (L)Other",null,null,1.5362,1.8226]
[null,"YGAA (T)","Unladen","Other",null,null,21,null,4,1764,"Y25_empty",5,null,"n/a",null,null,"YGAA (T)Other",null,null,1.0840000000000001,1.1676]
[null,"YGBA (L)","Laden","Construction Materials",null,null,55.752881320735128,null,4,1764,"Y25_loaded",5,null,"n/a",null,null,"YGBA (L)Construction Materials",null,null,1.5841000000000001,2.0118999999999998]
[null,"YGBA (T)","Unladen","Construction Materials",null,null,21.153557718060888,null,4,1764,"Y25_empty",5,null,"n/a",null,null,"YGBA (T)Construction Materials",null,null,1.1104000000000001,1.2793000000000001]
[null,"YGBA (L)","Laden","Enterprise",null,null,56.4,null,4,1764,"Y25_loaded",5,null,"n/a",null,null,"YGBA (L)Enterprise",null,null,1.6700999999999999,1.9978]
[null,"YGBA (T)","Unladen","Enterprise",null,null,21.10764484058965,null,4,1764,"Y25_empty",5,null,"n/a",null,null,"YGBA (T)Enterprise",null,null,1.1564000000000001,1.2234]
[null,"YGBA (L)","Laden","Other",null,null,54.495053133015759,null,4,1764,"Y25_loaded",5,null,"n/a",null,null,"YGBA (L)Other",null,null,1.5597000000000001,1.8963000000000001]
[null,"YGBA (T)","Unladen","Other",null,null,21.096508349598789,null,4,1764,"Y25_empty",5,null,"n/a",null,null,"YGBA (T)Other",null,null,1.0716000000000001,1.1672]
[null,"YGBD (L)","Laden","Construction Materials",null,null,56.523809523809518,null,4,1764,"Y25_loaded",5,null,"n/a",null,null,"YGBD (L)Construction Materials",null,null,1.5985,2.0396000000000001]
[null,"YGBD (T)","Unladen","Construction Materials",null,null,21.18523002421308,null,4,1764,"Y25_empty",5,null,"n/a",null,null,"YGBD (T)Construction Materials",null,null,1.115,1.2790999999999999]
[null,"YGBD (T)","Unladen","Other",null,null,21,null,4,1764,"Y25_empty",5,null,"n/a",null,null,"YGBD (T)Other",null,null,1.0770999999999999,1.1676]
[null,"YGBE (L)","Laden","Construction Materials",null,null,57.506027323868196,null,4,1764,"3piece_loaded",3,null,"n/a",null,null,"YGBE (L)Construction Materials",null,null,2.5823999999999998,3.5737999999999999]
[null,"YGBE (T)","Unladen","Construction Materials",null,null,21.268113522537565,null,4,1764,"3piece_empty",3,null,"n/a",null,null,"YGBE (T)Construction Materials",null,null,1.4247000000000001,1.6961999999999999]
[null,"YGBE (L)","Laden","Other",null,null,41.697547683923709,null,4,1764,"3piece_loaded",3,null,"n/a",null,null,"YGBE (L)Other",null,null,2.5968,3.5438000000000001]
[null,"YGBE (T)","Unladen","Other",null,null,21.310642377756473,null,4,1764,"3piece_empty",3,null,"n/a",null,null,"YGBE (T)Other",null,null,1.385,1.5743]
[null,"YGHB (L)","Laden","Construction Materials",null,null,59.37714712471994,null,4,1764,"Y25_loaded",5,null,"n/a",null,null,"YGHB (L)Construction Materials",null,null,1.6388,2.149]
[null,"YGHB (T)","Unladen","Construction Materials",null,null,22,null,4,1764,"Y25_empty",5,null,"n/a",null,null,"YGHB (T)Construction Materials",null,null,1.1143000000000001,1.2730999999999999]
[null,"YGHB (L)","Laden","Other",null,null,52.5,null,4,1764,"Y25_loaded",5,null,"n/a",null,null,"YGHB (L)Other",null,null,1.5528999999999999,1.8331]
[null,"YGHB (T)","Unladen","Other",null,null,22,null,4,1764,"Y25_empty",5,null,"n/a",null,null,"YGHB (T)Other",null,null,1.0777000000000001,1.1648000000000001]
[null,"YKAB (L)","Laden","Construction Materials",null,null,64.851453175457479,null,4,1764,"Y25_loaded",5,null,"n/a",null,null,"YKAB (L)Construction Materials",null,null,1.7244999999999999,2.3915000000000002]
[null,"YKAB (T)","Unladen","Construction Materials",null,null,25.389502762430944,null,4,1764,"Y25_empty",5,null,"n/a",null,null,"YKAB (T)Construction Materials",null,null,1.1211,1.2643]
[null,"YKAB (T)","Unladen","Enterprise",null,null,25.5,null,4,1764,"Y25_empty",5,null,"n/a",null,null,"YKAB (T)Enterprise",null,null,1.1778,1.2170000000000001]
[null,"YLAB (L)","Laden","Steel",null,null,54.402832314129384,null,4,1530,"Y25_loaded",5,null,"n/a",null,null,"YLAB (L)Steel",null,null,1.6733,1.8801000000000001]
[null,"YLAB (T)","Unladen","Steel",null,null,31,null,4,1530,"Y25_empty",5,null,"n/a",null,null,"YLAB (T)Steel",null,null,1.1234999999999999,1.1900999999999999]
[null,"YSAA (T)","Unladen","Construction Materials",null,null,48,null,4,1495,"NACO_empty",4,null,"n/a",null,null,"YSAA (T)Construction Materials",null,null,1.3661000000000001,1.7673000000000001]
[null,"YSAB (T)","Unladen","Steel",null,null,23,null,4,1495,"NACO_empty",4,null,"n/a",null,null,"YSAB (T)Steel",null,null,1.2566999999999999,1.4079999999999999]
[null,"YWAA (L)","Laden","Construction Materials",null,null,82,null,4,1764,"3piece_loaded",3,null,"n/a",null,null,"YWAA (L)Construction Materials",null,null,3.0142000000000002,4.6657000000000002]
[null,"YWAA (T)","Unladen","Construction Materials",null,null,25,null,4,1764,"3piece_empty",3,null,"n/a",null,null,"YWAA (T)Construction Materials",null,null,1.3945000000000001,1.6341000000000001]
[null,"YWAA (T)","Unladen","Steel",null,null,25,null,4,1764,"3piece_empty",3,null,"n/a",null,null,"YWAA (T)Steel",null,null,1.3591,1.5296000000000001]
[null,"YWAB (L)","Laden","Construction Materials",null,null,72.347368421052636,null,4,1764,"3piece_loaded",3,null,"n/a",null,null,"YWAB (L)Construction Materials",null,null,2.8725000000000001,4.0705999999999998]
[null,"YWAB (T)","Unladen","Construction Materials",null,null,25.169517293804638,null,4,1764,"3piece_empty",3,null,"n/a",null,null,"YWAB (T)Construction Materials",null,null,1.3937999999999999,1.6323000000000001]
[null,"YWAB (T)","Unladen","Enterprise",null,null,25.013043478260869,null,4,1764,"3piece_empty",3,null,"n/a",null,null,"YWAB (T)Enterprise",null,null,1.4543999999999999,1.5817000000000001]
[null,"YWAB (L)","Laden","Other",null,null,78,null,4,1764,"3piece_loaded",3,null,"n/a",null,null,"YWAB (L)Other",null,null,2.8439999999999999,4.2731000000000003]
[null,"YWAB (T)","Unladen","Other",null,null,25,null,4,1764,"3piece_empty",3,null,"n/a",null,null,"YWAB (T)Other",null,null,1.3591,1.5296000000000001]
[null,"YWAB (L)","Laden","Steel",null,null,56,null,4,1764,"3piece_loaded",3,null,"n/a",null,null,"YWAB (L)Steel",null,null,2.6936,3.4738000000000002]
[null,"YWAB (T)","Unladen","Steel",null,null,25.233480176211458,null,4,1764,"3piece_empty",3,null,"n/a",null,null,"YWAB (T)Steel",null,null,1.3585,1.5281]
[null,"YXAB (T)","Unladen","Other",null,null,37.5,null,4,2200,"Y25_empty",5,null,"n/a",null,null,"YXAB (T)Other",null,null,1.2434000000000001,1.3442000000000001]
[null,"ZCAB (T)","Unladen","Other",null,null,15,null,2,1684,"2axle_empty",1,null,"n/a",null,null,"ZCAB (T)Other",null,null,1.3221000000000001,1.5547]
[null,"ZCAB (L)","Laden","Steel",null,null,39.963337547408344,null,2,1684,"2axle_loaded",1,null,"n/a",null,null,"ZCAB (L)Steel",null,null,2.6172,3.9916]
[null,"ZCAB (T)","Unladen","Steel",null,null,15,null,2,1684,"2axle_empty",1,null,"n/a",null,null,"ZCAB (T)Steel",null,null,1.3254999999999999,1.5547]
[null,"ZCAC (T)","Unladen","Other",null,null,15,null,2,1684,"2axle_empty",1,null,"n/a",null,null,"ZCAC (T)Other",null,null,1.3197000000000001,1.5547]
[null,"ZCAC (L)","Laden","Steel",null,null,25.992118683356512,null,2,1684,"2axle_loaded",1,null,"n/a",null,null,"ZCAC (L)Steel",null,null,2.2978999999999998,2.5053000000000001]
[null,"ZCAC (T)","Unladen","Steel",null,null,15,null,2,1684,"2axle_empty",1,null,"n/a",null,null,"ZCAC (T)Steel",null,null,1.3197000000000001,1.5547]
[null,"ZCAD (L)","Laden","Construction Materials",null,null,36.231875128363114,null,2,1383,"2axle_loaded",1,null,"n/a",null,null,"ZCAD (L)Construction Materials",null,null,2.0646,3.5369000000000002]
[null,"ZCAD (T)","Unladen","Construction Materials",null,null,14,null,2,1383,"2axle_empty",1,null,"n/a",null,null,"ZCAD (T)Construction Materials",null,null,1.3261000000000001,1.5763]
[null,"ZCAD (L)","Laden","Enterprise",null,null,35.506329113924053,null,2,1383,"2axle_loaded",1,null,"n/a",null,null,"ZCAD (L)Enterprise",null,null,2.0720000000000001,3.3873000000000002]
[null,"ZCAD (T)","Unladen","Enterprise",null,null,14,null,2,1383,"2axle_empty",1,null,"n/a",null,null,"ZCAD (T)Enterprise",null,null,1.4011,1.5409999999999999]
[null,"ZCAD (T)","Unladen","Other",null,null,14,null,2,1383,"2axle_empty",1,null,"n/a",null,null,"ZCAD (T)Other",null,null,1.3024,1.5058]
[null,"ZCAD (L)","Laden","Steel",null,null,39.379358437935842,null,2,1383,"2axle_loaded",1,null,"n/a",null,null,"ZCAD (L)Steel",null,null,2.2616999999999998,3.8837999999999999]
[null,"ZCAD (T)","Unladen","Steel",null,null,14,null,2,1383,"2axle_empty",1,null,"n/a",null,null,"ZCAD (T)Steel",null,null,1.3024,1.5058]
[null,"ZCAP (L)","Laden","Construction Materials",null,null,39.847008547008549,null,2,1684,"2axle_loaded",1,null,"n/a",null,null,"ZCAP (L)Construction Materials",null,null,2.8485999999999998,4.1142000000000003]
[null,"ZCAP (T)","Unladen","Construction Materials",null,null,15,null,2,1684,"2axle_empty",1,null,"n/a",null,null,"ZCAP (T)Construction Materials",null,null,1.3573999999999999,1.6456]
[null,"ZCAP (T)","Unladen","Other",null,null,15,null,2,1684,"2axle_empty",1,null,"n/a",null,null,"ZCAP (T)Other",null,null,1.3270999999999999,1.5547]
[null,"ZCAP (L)","Laden","Steel",null,null,43.091052029731273,null,2,1684,"2axle_loaded",1,null,"n/a",null,null,"ZCAP (L)Steel",null,null,2.9693000000000001,4.5542999999999996]
[null,"ZCAP (T)","Unladen","Steel",null,null,15,null,2,1684,"2axle_empty",1,null,"n/a",null,null,"ZCAP (T)Steel",null,null,1.3267,1.5547]
[null,"ZCAQ (T)","Unladen","Other",null,null,15,null,2,1684,"2axle_empty",1,null,"n/a",null,null,"ZCAQ (T)Other",null,null,1.256,1.5547]
[null,"ZCAQ (L)","Laden","Steel",null,null,42.477023374145332,null,2,1684,"2axle_loaded",1,null,"n/a",null,null,"ZCAQ (L)Steel",null,null,2.7858000000000001,4.4356999999999998]
[null,"ZCAQ (T)","Unladen","Steel",null,null,15,null,2,1684,"2axle_empty",1,null,"n/a",null,null,"ZCAQ (T)Steel",null,null,1.2576000000000001,1.5547]
[null,"ZIBC (T)","Unladen","Other",null,null,117,null,8,1764,"Y25_empty",5,null,"n/a",null,null,"ZIBC (T)Other",null,null,1.5369999999999999,1.829]
[null,"ZOAK (T)","Unladen","Construction Materials",null,null,106.35113386978787,null,8,1764,"Y25_empty",5,null,"n/a",null,null,"ZOAK (T)Construction Materials",null,null,1.4543999999999999,1.6951000000000001]
[null,"ZOAK (T)","Unladen","Other",null,null,106,null,8,1764,"Y25_empty",5,null,"n/a",null,null,"ZOAK (T)Other",null,null,1.4279999999999999,1.6176999999999999]
[null,"ZWAB (T)","Unladen","Construction Materials",null,null,82,null,4,1764,"Y25_empty",5,null,"n/a",null,null,"ZWAB (T)Construction Materials",null,null,2.1063999999999998,3.3835999999999999]
[null,"ZWAE (T)","Unladen","Construction Materials",null,null,45.95,null,4,1764,"Y25_empty",5,null,"n/a",null,null,"ZWAE (T)Construction Materials",null,null,1.4782999999999999,1.5644]

{"sheet":"Parameters","index":3,"n_rows":81,"n_cols":26,"rows_kept":81,"cut":false,"hidden":true,"merged":[[30,12,31,12],[30,13,31,13],[30,14,31,14],[30,15,30,16]]}
[]
[]
[]
[]
[null,null,"Vertical",null,null,null,null,null,null,null,null,"Civils"]
[null,null,"Ct",0.89,1,null,null,null,null,null,null,"Ct",1.2,1]
[null,null,"A",0.47299999999999998,0.13300000000000001,null,null,null,null,null,null,"A",3]
[null,null,"S",1.4999999999999999E-2,null,null,null,null,null,null,null,"S",1.52]
[null,null,"S",8.9999999999999993E-3]
[null,null,"U",0.28399999999999997]
[null,null,null,0.442]
[]
[]
[]
[]
[null,null,null,null,null,null,null,null,null,null,"Freight suspension bands",null,null,null,null,"Indexation factors",null,null,null,"CP5 indexation factors",null,null,"CP6 indexation factors"]
[null,null,null,null,null,null,null,null,null,null,"Band","Curving class",null,"Factor",null,"Year","factor"]
[null,null,null,null,null,null,null,null,null,null,null,null,"CP4 model","CP5 model",null,null,"Passenger","Freight","Charter",null,"Passenger","Freight",null,"Passenger","Freight","Charter"]
[null,null,null,null,null,null,null,null,null,null,1,"2axle-1",1.0979551999999999,1.0980000000000001,null,"2023/24",1,1,1,"2012/13",1,1,"2017/18",1,1,1]
[null,null,null,null,null,null,null,null,null,null,2,"2axle-2",1.0579552000000001,1.0580000000000001,null,null,null,null,null,"2014/15",1.054,1.0620000000000001,"2019/20",1.046,1.05,1.046]
[null,null,"Normalising parameters for damage calculations",null,null,null,null,null,null,null,3,"3piece",1.0179552000000001,1.018,null,null,null,null,null,"2015/16",1.02,1.087,"2020/21",1.014,1.069,1.0609999999999999]
[null,null,null,"Unsprung mass (kg)",1000,null,null,null,null,null,4,"NACO",0.97795520000000002,0.97799999999999998,null,null,null,null,null,"2016/17",1.0109999999999999,1.0980000000000001,"2021/22",1.004,1.0780000000000001,1.0649999999999999]
[null,null,null,"Axleload (t)",10,null,null,null,null,null,5,"Y25-1",0.93795519999999999,0.93799999999999994,null,null,null,null,null,"2017/18",1.022,1.117,"2022/23",1.0509999999999999,1.1060000000000001,1.119]
[null,null,null,"Speed (mph)",50,null,null,null,null,null,6,"Y25-2",0.89795519999999995,0.89800000000000002,null,null,null,null,null,"2018/19",1.0389999999999999,1.157,"2023/24",1.107,1.2059848219342304,1.2390000000000001]
[null,null,null,null,null,null,null,null,null,null,7,"Steering",0.85795520000000003,0.85799999999999998,null,null,null,null,null,null,null,null,null,null,1.206]
[null,null,null,null,null,null,null,null,null,null,0,"Locomotive",1,1]
[]
[null,null,"Conversion factors: convert damage to £/kGTM"]
[null,null,null,"Values taken from 'PR23 VUC model v2.4.xlsx'"]
[null,null,"Track",11.110708846059627,null,7.5279873323221942,"CP5 values",9.8176226967605107,"CP6 values"]
[null,null,"Civils",0.14599659469101026,null,9.5364473885091269E-2,null,0.14777755470356627,null,null,null,null,"Commodity","CP5 Average Speed","CP5 Average Speed (taking into account stopping time)","CP4 speed",null,null,"Sample passenger vehicles"]
[null,null,"Surface",801.89266688969929,null,376.29434250585814,null,523.80070692377399,null,null,null,null,null,null,null,"Laden","Empty",null,"Motor","Trailer"]
[null,null,"Signals",0.31863297311655303,null,0.30801691951461263,null,0.26545074411077302,null,null,null,null,"Coal other",22,25,35,41,null,"M","T"]
[null,null,"Signals (vm)",0.27923943759191183,"(pence/vehicle mile)",0.3093304189035963,null,0.239583310239116,null,null,null,null,"Iron Ore",22,25,32,41,null,"BDMSO","DTCO"]
[null,null,null,null,null,null,null,null,null,null,null,null,"Steel",22,25,35,41,null,"DMBS","DTPMV"]
[null,null,null,null,null,null,null,null,null,null,null,null,"Domestic Waste",21,24,40,50,null,"DMCL","DTSO"]
[null,null,null,"Curve distribution",null,null,"Surface damage parameters",null,null,null,"CP6 values",null,"Construction Materials",26,29,35,41,null,"DMCL(A)","DTSO(A)"]
[null,null,null,"Radius","Length (km): CP5","CP4",null,"Grinding Cost",1184.1793274363536,"GBP/km",2000,null,"Petroleum",20,23,35,41,null,"DMCL(B)","DTSO(B)"]
[null,null,null,200,83,83.085887256964426,null,"Renewal Cost",232784.98383825034,"GBP/km",250000,null,"Coal ESI",21,24,32,41,null,"DMCO","PDTRBFO"]
[null,null,null,400,334,332.34354902785765,null,"Depth Ground",0.5,"mm/grinding cycle",0.5,null,"European Intermodal",33,38,46,47,null,"DMF","PDTSO"]
[null,null,null,600,778,775.46828106500107,null,"Side Wear Limit",10,"mm",10,null,"Domestic Automotive",22,25,46,47,null,"DMFO","PDTSO(A)"]
[null,null,null,800,1879,1871.6063411050484,null,"Crack Damage Rate",{"$f":"0.00001/50","v":2.0000000000000002E-7},null,2.0000000000000002E-7,null,"European Automotive",27,31,46,47,null,"DMRBFO","PDTSO(B)"]
[null,null,null,1000,1193,1187.1863599445423,null,"Wear Damage Rate",{"$f":"I42*160/110","v":2.9090909090909096E-7},null,2.9090909090909096E-7,null,"Industrial Minerals",16,18,35,41,null,"DMRF","PTFO"]
[null,null,null,1200,1193,1187.1863599445423,null,null,null,null,null,null,"General Merchandise",26,30,40,50,null,"DMS","PTSO"]
[null,null,null,1400,1193,1187.1863599445423,null,null,null,null,null,null,"Royal Mail",69,78,67,67,null,"DMSL","PTSRMB"]
[null,null,null,1800,1885,1877.5441344946576,null,null,null,null,null,null,"Mail and Premium Logistics",69,78,67,67,null,"DMSL(A)","TCO"]
[null,null,null,2200,1718,1711.9346060298467,null,null,null,null,null,null,"Domestic Intermodal",29,33,46,47,null,"DMSL(B)","TPMV"]
[null,null,null,2600,1718,1711.9346060298503,null,null,null,null,null,null,"Engineering haulage",16,18,35,41,null,"DMSO","TSL"]
[null,null,null,3000,1718,1711.9346060298467,null,null,null,null,null,null,"Enterprise",24,27,40,50,null,"DMSO(A)","TSO"]
[null,null,null,4000,4294,4279.8365150746195,null,null,null,null,null,null,"European Conventional",28,31,40,50,null,"DMSO(B)","TSORMB"]
[null,null,null,6000,0,0,null,null,null,null,null,null,"Other",22,25,35,41,null,"MBC","TSRB"]
[null,null,null,8000,0,0,null,null,null,null,null,null,"Biomass",30,34,35,41,null,"MC"]
[null,null,null,10000,0,0,null,null,null,null,null,null,"Chemicals",14,16,35,41,null,"MF"]
[null,null,null,"Straight",11110,11088.422906852678,null,null,null,null,null,null,null,null,null,null,null,null,"MFL"]
[null,null,null,null,null,null,null,null,null,null,null,null,null,null,null,null,null,null,"MFO"]
[null,null,null,"Total length (km)",{"$f":"SUM(E39:E54)","v":29096},{"$f":"SUM(F39:F54)","v":29005.670512799996},null,null,null,null,null,null,null,null,null,null,null,null,"MFO(A)"]
[null,null,null,null,null,null,null,null,null,null,null,null,null,null,null,null,null,null,"MFO(B)"]
[null,null,"VTAC efficiency reduction (%)",null,null,0,"CP5 value",18.910861767309001,"CP6 value",11.4181760418909,null,null,null,null,null,null,null,null,"MOS(B)"]
[null,null,"CP4 factors (for freight only)",null,null,null,null,null,null,null,null,null,null,null,null,null,null,null,"MPMV"]
[null,null,"CP4 efficiency reduction (%)",null,null,34,null,null,null,null,null,null,null,null,null,null,null,null,"MS"]
[null,null,"2009/2010 increment",null,null,1.1040000000000001,null,null,null,null,null,null,null,null,null,null,null,null,"MSL"]
[null,null,"2010/2011 increment",null,null,0.995,null,null,null,null,null,null,null,null,null,null,null,null,"MSO"]
[null,null,"2011/2012 increment",null,null,1.046,null,null,null,null,null,null,null,null,null,null,null,null,"MSO(A)"]
[null,null,"2012/2013 increment",null,null,1.052,null,null,null,null,null,null,null,null,null,null,null,null,"MSO(A)"]
[null,null,null,null,null,null,null,null,null,null,null,null,null,null,null,null,null,null,"MSO(B)"]
[null,null,"ORR cap as a % CP4-CP5 variance",null,null,0.42769809731324887,null,null,null,null,null,null,null,null,null,null,null,null,"MSO(C)"]
[null,null,null,null,null,null,null,null,null,null,null,null,null,null,null,null,null,null,"MSRMB"]
[null,null,null,null,null,"2014/15","2015/16","2016/17","2017/18","2018/19",null,null,null,null,null,null,null,null,"PMSO"]
[null,null,"ORR phasing profile for freight charges",null,null,0,0,0.2,0.6,1]
[null,null,null,null,null,"2019/20","2020/21","2021/22","2022/23","2023/24"]
[null,null,"ORR phasing profile for freight charges",null,null,0,0,0.125,0.25,0.375]
[null,null,null,null,null,"2024/25","2025/26","2026/27","2027/28","2028/29"]
[null,null,"ORR phasing profile for freight charges",null,null,0.2,0.4,0.6,0.8,1]
[]
[null,null,null,null,"RPI versus CPI indexation adjustment",1,"CP6",1.04]
[]
[null,null,null,null,"Average increase to 2018/19 rate (%)",7.8164146577620102]
[null,null,null,null,"NYMR uplift (%)",6.9968286314844903]
[null,null,null,null,"Jacobite uplift (%)",5.2674331405959496]
[]
[null,null,null,null,"CP6 uncapped rate increase in 2023/24 prices",0.2756852626994446]

{"sheet":"TGamma","index":4,"n_rows":99,"n_cols":128,"rows_kept":99,"cut":false,"hidden":true,"merged":[[68,0,82,0],[84,0,98,0],[4,0,18,0],[20,0,34,0],[36,0,50,0],[52,0,66,0]]}
["NOTES"]
[null,null,"Curving class","Loco2_50","Loco3_50","Class_60","Class_66","Pacer_10","Coach_8","Coach_12_30","Coach_12_35","Coach_12_40","Coach_12_50","Coach_12_60","Coach_16_30","Coach_16_35","Coach_16_40","Coach_16_50","Coach_17_30","Coach_17_40","Coach_23_30","Coach_23_40","Coach_23_50","Coach_24_30","Coach_24_35","Coach_24_40","Coach_24_50","Coach_24_60","Coach_26_50","Coach_35_50","Coach_48_40","Coach_48_50","Coach_48_60","Coach_50_40","Coach_50_50","Coach_50_60","Coach_60_50","Coach_64_30","Coach_64_35","Coach_64_40","Coach_64_50","Coach_64_60","Coach_80_30","Coach_80_40","Coach_80_50","Coach_100_40","Coach_128_30","Coach_128_35","Coach_128_40","Coach_128_50","Tilting_50_50","Artic2_80","Artic3","Y25_loaded","Y25_empty","NACO_loaded","NACO_empty","3piece_empty","3piece_loaded","2axle_empty","2axle_loaded","LN25_empty","LN25_loaded","Coach_15_30","Coach_15_40","Coach_15_60","Shunter","Coach_HB_40","Coach_HB_50","Coach_HB_60","Coach_HB_Cl221","Class_68","PPM_2axle","Class_70","Cl_88/0","Cl_390/HB/T","Cl_390/HB/M","Cl_707/M","Cl_707/T","185HB/M","Cl_345/M_FLU","Cl_345/M_RLU","Cl_345/T","Cl_385/M","Cl_385/T","Cl_717/M","Cl_717/T","Coach_5","Coach_5A","Cl_195/M","Cl_196/0/M","Cl_196/1/M","Cl_331/M","Cl_ 331/T","Cl_397/M","Cl_ 397/T","Cl_399/0","Cl_700/M","Cl_ 700/T","Cl_701/T","Cl_701/0/M1","Cl_701/0/M2","Cl_701/5/M1","Cl_701/5/M2","Cl_720/5/M","Cl_ 720/5/T","Cl_777/M","Cl_755/4/M","Cl_755/4/T","Cl_ 777/T","Cl_800/M_FLU","Cl_800/M_RLU","Cl_ 800/T_FLU","Cl_ 800/T_RLU","Cl_802/M","Cl_802/M_FLU","Cl_802/M_RLU","Cl_ 802/T","Cl_ 802/T_FLU","Cl_ 802/T_RLU","Cl_803/M","Cl_ 803/T","FFAG (L)","FFAG (T)","FWAC (L)","FWAC (T)","FWAD (L)","FWAD (T)"]
[null,null,"Reference","SS015_01 Tgammas Cant Def_Base Case.xls","SS015_01 Tgammas Cant Def_Base Case.xls","SS015_01 Tgammas Cant Def_Base Case.xls","SS015_01 Tgammas Cant Def_Base Case.xls","SS015_01 Tgammas Cant Def_Base Case.xls","C:\\K3A7B1 NR Access Ch\\TGammaTables\\VDM_Vehicle_generic_Stiffness_8_Lube_Yes.csv Wt= 45 CD= 40",null,"C:\\K3A7B1 NR Access Ch\\TGammaTables\\VDM_Vehicle_generic_Stiffness_12_Lube_Yes.csv Wt= 35 CD= 40 profile= mod type2","C:\\K3A7B1 NR Access Ch\\TGammaTables\\VDM_Vehicle_generic_Stiffness_12_Lube_Yes.csv Wt= 40 CD= 40 profile= mod type2","C:\\K3A7B1 NR Access Ch\\TGammaTables\\VDM_Vehicle_generic_Stiffness_12_Lube_Yes.csv Wt= 50 CD= 40 profile= mod type2",null,"C:\\K3A7B1 NR Access Ch\\TGammaTables\\VDM_Vehicle_generic_Stiffness_16_Lube_Yes.csv","C:\\K3A7B1 NR Access Ch\\TGammaTables\\VDM_Vehicle_generic_Stiffness_16_Lube_Yes.csv Wt= 35 CD= 40 profile= mod type2","C:\\K3A7B1 NR Access Ch\\TGammaTables\\VDM_Vehicle_generic_Stiffness_16_Lube_Yes.csv Wt= 50 CD= 40 profile= mod type2","C:\\K3A7B1 NR Access Ch\\TGammaTables\\VDM_Vehicle_generic_Stiffness_16_Lube_Yes.csv Wt= 50 CD= 40 profile= mod type2","Veh:generic_PYS:17_Weight:30_Con:mod type2_Lube:Yes_CD:40","Veh:generic_PYS:17_Weight:40_Con:mod type2_Lube:Yes_CD:40","Veh:generic_PYS:23_Weight:30_Con:mod type2_Lube:Yes_CD:40","Veh:generic_PYS:23_Weight:40_Con:mod type2_Lube:Yes_CD:40","Veh:generic_PYS:23_Weight:50_Con:mod type2_Lube:Yes_CD:40",null,"C:\\K3A7B1 NR Access Ch\\TGammaTables\\VDM_Vehicle_generic_Stiffness_24_Lube_Yes.csv Wt= 35 CD= 40 profile= mod type2","C:\\K3A7B1 NR Access Ch\\TGammaTables\\VDM_Vehicle_generic_Stiffness_24_Lube_Yes.csv Wt= 40 CD= 40 profile= mod type2","C:\\K3A7B1 NR Access Ch\\TGammaTables\\VDM_Vehicle_generic_Stiffness_24_Lube_Yes.csv Wt= 50 CD= 40 profile= mod type2","Veh:generic_PYS:24_Weight:60_Con:mod type2_Lube:Yes_CD:40","Veh:generic_PYS:26_Weight:50_Con:mod type2_Lube:Yes_CD:40","Veh:generic_PYS:35_Weight:50_Con:mod type2_Lube:Yes_CD:40","C:\\K3A7B1 NR Access Ch\\TGammaTables\\VDM_Vehicle_generic_Stiffness_48_Lube_Yes.csv Wt= 40 CD= 40 profile= mod type2","C:\\K3A7B1 NR Access Ch\\TGammaTables\\VDM_Vehicle_generic_Stiffness_48_Lube_Yes.csv Wt= 50 CD= 40 profile= mod type2","C:\\K3A7B1 NR Access Ch\\TGammaTables\\VDM_Vehicle_generic_Stiffness_48_Lube_Yes.csv","Veh:generic_PYS:50_Weight:40_Con:mod type2_Lube:Yes_CD:40","Veh:generic_PYS:50_Weight:50_Con:mod type2_Lube:Yes_CD:40","Veh:generic_PYS:50_Weight:60_Con:mod type2_Lube:Yes_CD:40","Veh:generic_PYS:60_Weight:50_Con:mod type2_Lube:Yes_CD:40",null,"C:\\K3A7B1 NR Access Ch\\TGammaTables\\VDM_Vehicle_generic_Stiffness_64_Lube_Yes.csv Wt= 35 CD= 40 profile= mod type2","C:\\K3A7B1 NR Access Ch\\TGammaTables\\VDM_Vehicle_generic_Stiffness_64_Lube_Yes.csv Wt= 40 CD= 40 profile= mod type2","C:\\K3A7B1 NR Access Ch\\TGammaTables\\VDM_Vehicle_generic_Stiffness_64_Lube_Yes.csv Wt= 50 CD= 40 profile= mod type2","C:\\K3A7B1 NR Access Ch\\TGammaTables\\VDM_Vehicle_generic_Stiffness_64_Lube_Yes.csv","Veh:generic_PYS:80_Weight:30_Con:mod type2_Lube:Yes_CD:40","Veh:generic_PYS:80_Weight:40_Con:mod type2_Lube:Yes_CD:40","Veh:generic_PYS:80_Weight:50_Con:mod type2_Lube:Yes_CD:40","Veh:generic_PYS:100_Weight:40_Con:mod type2_Lube:Yes_CD:40",null,"C:\\K3A7B1 NR Access Ch\\TGammaTables\\VDM_Vehicle_generic_Stiffness_128_Lube_Yes.csv Wt= 35 CD= 40 profile= mod type2","C:\\K3A7B1 NR Access Ch\\TGammaTables\\VDM_Vehicle_generic_Stiffness_128_Lube_Yes.csv Wt= 40 CD= 40 profile= mod type2","C:\\K3A7B1 NR Access Ch\\TGammaTables\\VDM_Vehicle_generic_Stiffness_128_Lube_Yes.csv Wt= 50 CD= 40 profile= mod type2","Temporary values until CD value agreed","SS015_01 Tgammas Cant Def_Base Case.xls","SS015_01 Tgammas Cant Def_Base Case.xls","SS015_01 Tgammas Cant Def_Base Case.xls","SS015_01 Tgammas Cant Def_Base Case.xls","SS015_01 Tgammas Cant Def_Base Case.xls","SS015_01 Tgammas Cant Def_Base Case.xls","SS015_01 Tgammas Cant Def_Base Case.xls","SS015_01 Tgammas Cant Def_Base Case.xls","SS015_01 Tgammas Cant Def_Base Case.xls","SS015_01 Tgammas Cant Def_Base Case.xls",null,null,"Interpolate","Interpolate","Interpolate","Assume half Loco3_50",null,null,null,"HALL bush for Cl221 DEMU",null,"Cl139"]
[null,"Radius"]
["Wheelset 1",200,null,727.97263352390996,926.05033303612095,857.55908704783803,645.18792074310898,703.09698500000002,158.98587036132813,149.58293151855469,164.25064086914063,178.91835021972656,203.25019836425781,227.58204650878906,154.31181335449219,173.1998291015625,192.08784484863281,222.37841796875,154.24610899999999,193.8979492,159.83790590000001,202.86097720000001,243.19850159999999,161.56285095214844,182.67265319824219,203.78245544433594,244.87234497070313,280.41659550000003,247.867569,257.42016599999999,217.53550720214844,263.48764038085938,309.43977355957031,218.12760929999999,264.52145389999998,312.7772827,268.5058899,170.596435546875,195.87808227539063,221.15972900390625,269.795654296875,318.43157958984375,169.62133789999999,223.2370148,272.91873170000002,224.8818359,171.05290222167969,198.71234130859375,226.37178039550781,277.9349365234375,263.48764038085938,181.87257731969601,589.46537660427703,239.63895190745501,112.15399124865399,530.27443620980705,148.839426105098,143.577871007353,522.95943161312596,175.87575589150401,589.25764481114095,null,null,{"$f":"J5+(O5-J5)*0.75","v":153.12959289550781},{"$f":"L5+(Q5-L5)*0.75","v":188.79547119140625},{"$f":"N5+(R5-N5)*0.75","v":223.67932510375977},{"$f":"E5/2","v":463.02516651806047},151.186381936765,171.89818383626201,190.521908573936,222.232718048164,460,107.998471441094,568.70000000000005,460,225.88,229.96,134,114.3,201.2,137.77000000000001,145.43,108.97,203.1,168.6,141.24700000000001,104.593,169.87,168.02,207.6,207.6,200.35000000000002,212.60000000000002,172.4,205.6,194.4,134.33330000000001,159.53899999999999,146.60900000000001,113.5,154.80000000000001,117.2,166.8,117,149.32175000000001,161.846,180.5,190.521908573936,171.89818383626201,169,249,249,175.55,242.7,249,249,249,242.7,209.125,242.7,220.9,239.8,208.244,89.742999999999995,225.08699999999999,92.980999999999995,225.08699999999999,92.980999999999995]
[null,400,null,359.83060312368201,437.15907854752197,368.889734606324,50.185014862612,158.432999,57.968143463134766,72.486930847167969,76.004669189453125,79.522407531738281,83.268745422363281,87.015083312988281,77.040657043457031,83.026237487792969,89.011817932128906,97.843254089355469,76.526161189999996,90.599090579999995,80.684738159999995,97.01605988,110.4172592,81.749267578125,89.774436950683594,97.799606323242188,111.56788635253906,124.124588,113.59973909999999,120.34703829999999,107.30943298339844,125.43875885009766,143.56808471679688,107.6462021,126.0126114,143.64926149999999,128.38230899999999,88.390975952148438,98.896766662597656,109.40255737304688,129.14910888671875,148.89566040039063,90.320373540000006,110.6723709,131.2376404,111.696434,94.002708435058594,103.30239868164063,112.60208892822266,134.06900024414063,125.43875885009766,44.472548614936997,373.988668826349,86.504789782473196,64.645870382732397,284.40240858015602,93.902617147580202,86.096458267632102,346.84281780879797,106.836494087392,143.479065264561,null,null,{"$f":"J6+(O6-J6)*0.75","v":75.902225494384766},{"$f":"L6+(Q6-L6)*0.75","v":86.63946533203125},{"$f":"N6+(R6-N6)*0.75","v":95.136211395263672},{"$f":"E6/2","v":218.57953927376099},60.368582933785703,57.877825783092398,60.761685330144303,85.157849720460106,203,75.692249318161302,312.2,203,94.82,97.83,57.5,47.7,64.5,53.29,56.57,42.53,94.2,76.2,97.405000000000001,82.703999999999994,76.42,76.680000000000007,90.233333333333334,89.15,86.725000000000009,92.55,79.5,96.166666666666671,90.7,62.333329999999997,59.459000000000003,57.002000000000002,51.2,67.5,53.1,71,53.1,64.729250000000008,67.965999999999994,72.5,60.761685330144303,60.761685330144303,70,110.3,110.3,66.95,108.3,110.3,110.3,110.3,108.3,87.625,108.3,102.4,107.7,81.778999999999996,38.100999999999999,88.298000000000002,39.716999999999999,88.298000000000002,39.716999999999999]
[null,600,null,207.49320873467499,255.851229433855,188.159036489633,4.3559035963454402,33.9220009,40.803493499755859,47.443019866943359,54.362945556640625,61.282871246337891,69.221519470214844,77.160167694091797,46.682903289794922,53.897148132324219,61.111392974853516,73.6800537109375,46.16686249,61.060962680000003,45.519592289999999,60.779644009999998,74.433891299999999,45.841915130615234,53.290393829345703,60.738872528076172,74.46148681640625,86.37200928,74.512046810000001,74.649848939999998,59.895488739013672,74.524627685546875,89.153766632080078,59.830596919999998,74.505126950000005,88.372550959999998,74.427795410000002,43.872829437255859,51.675621032714844,59.478412628173828,74.383918762207031,89.289424896240234,45.6049881,59.263080600000002,74.238975519999997,59.071414949999998,46.067329406738281,52.477573394775391,58.8878173828125,73.95928955078125,74.524627685546875,16.313217955533901,200.22475542340899,49.942626784297502,37.979157860839301,131.17295482060601,34.943629382407799,39.457026647441097,144.718409418682,1.0909796411673001,2.5988735345555298,null,null,46.872932434082031,61.154262542724609,74.550082206726074,127.9256147169275,44.4147791167062,42.887708289664801,39.8610018392596,70.250539446891594,127,46.301206780483298,194,127,66.36,67.52,55.6,46.3,48.7,41.6,45.1,30.2,50.7,44.5,53.713999999999999,46.688000000000002,69.03,66.680000000000007,84.266666666666666,86.35,83.025000000000006,84.949999999999989,69.349999999999994,79.3,74.900000000000006,37.333329999999997,52.802999999999997,46.441000000000003,42.7,59.3,44.1,60.9,44.1,56.56,59.201999999999998,45,39.8610018392596,39.8610018392596,49,63.3,63.3,34.299999999999997,61.75,63.3,63.3,63.3,61.75,48.025000000000006,61.75,57.3,61.2,46.695999999999998,29.335999999999999,46.514000000000003,31.545000000000002,46.514000000000003,31.545000000000002]
[null,800,null,126.88131310701201,151.89149550897201,115.316556400013,2.5126470747475702,17.5939999,17.636526107788086,42.953487396240234,42.170505523681641,41.387523651123047,37.53070068359375,33.673877716064453,49.9364013671875,50.673267364501953,51.410133361816406,50.394397735595703,49.087749479999999,53.801593779999997,52.78537369,61.139911650000002,65.388145449999996,54.738155364990234,58.39776611328125,62.057376861572266,66.784927368164063,71.225532529999995,69.288940429999997,77.226722719999998,72.24273681640625,83.724525451660156,95.206314086914063,72.631874080000003,84.460342409999996,96.495315550000001,87.416267399999995,59.455535888671875,67.062141418457031,74.668746948242188,88.339073181152344,102.0093994140625,59.098522189999997,74.934349060000002,89.460739140000001,74.935859679999993,59.431968688964844,67.18670654296875,74.941444396972656,89.787361145019531,83.724525451660156,10.9212823576683,159.90427756258001,41.8586496293943,18.679469485291602,121.94436125427301,38.253255970653598,31.048832856803401,89.061041053590799,1.26988359870291,0.75036603008087299,null,null,48.190672874450684,48.904480934143066,46.214267730712891,75.945747754486007,28.611700933622998,24.565133409829301,21.995171047537401,33.7318098069942,94,53.786190204631502,131.1,94,39.46,41.07,30.9,25.8,28.9,23.18,25.19,16.739999999999998,34.200000000000003,23.9,30.475999999999999,25.855,43.57,46.62,52.1,51.099999999999994,50.174999999999997,53.8,46.65,56.199999999999996,53.6,20,27.413,24.105,23.5,33.200000000000003,24.3,33.6,24.3,31.641000000000002,32.597999999999999,25,21.995171047537401,21.995171047537401,27,40.1,40.1,17.350000000000001,22.75,40.1,40.1,40.1,22.75,29.049999999999997,22.75,44.4,41.3,26.597000000000001,18.384,27.012,20.606000000000002,27.012,20.606000000000002]
[null,1000,null,120.48298098133699,105.785820093254,106.350521461331,1.6712363078480601,9.6029996900000008,11.349647521972656,28.898900985717773,25.819370269775391,22.739839553833008,19.427656173706055,16.115472793579102,34.340187072753906,33.382789611816406,32.425392150878906,28.651405334472656,32.978008269999997,34.023609159999999,35.977233890000001,40.472557070000001,42.082546229999998,37.107616424560547,39.124225616455078,41.140834808349609,43.100383758544922,43.289710999999997,44.97490311,50.951450350000002,48.854045867919922,55.982921600341797,63.111797332763672,49.159034730000002,56.532459260000003,64.098518369999994,58.741596219999998,41.648506164550781,46.210681915283203,50.772857666015625,59.435726165771484,68.098594665527344,41.516704560000001,51.971889500000003,61.52905655,52.929054260000001,42.712608337402344,48.230426788330078,53.748245239257813,64.680870056152344,55.982921600341797,10.0598211764138,106.591091662381,21.7296937786802,25.8711818370689,107.679628296936,17.846965583489801,11.114482609106499,72.026062945930306,1.55439595658644,0.415749018519944,null,null,32.979865550994873,30.004004001617432,25.517422199249268,52.892910046627001,18.709097325043,15.120045963194,13.168589025654001,18.007102863465999,93,42.038995720412302,102.2,93,23.13,24.18,17.399999999999999,15.3,18.8,13.37,14.7,9.08,20.2,13.6,16.716000000000001,16.117000000000001,28.43,31.24,33.833333333333336,33.049999999999997,32.65,35.200000000000003,31.25,38.166666666666664,36.700000000000003,12.66667,14.478999999999999,13.451000000000001,13.7,20.399999999999999,14.2,20.399999999999999,14.2,19.3215,20.004000000000001,15,13.168589025654001,13.168589025654001,15.5,23.6,23.6,9.25,24.1,23.6,23.6,23.6,24.1,16.675000000000001,24.1,26.7,24.5,16.992999999999999,12.864000000000001,16.861999999999998,14.569000000000001,16.861999999999998,14.569000000000001]
[null,1200,null,112.977876161982,96.011778379033203,68.430587246268402,1.3412009426356,6.4990000700000001,7.5299715995788574,16.706501960754395,15.77397632598877,14.841450691223145,12.629712104797363,10.417973518371582,22.643789291381836,21.305364608764648,19.966939926147461,18.372640609741211,22.75479507,21.232044219999999,25.67230034,27.65056229,26.24343872,26.718761444091797,27.5137939453125,28.308826446533203,27.23261833190918,27.890981669999999,29.243625640000001,35.078121189999997,35.325389862060547,39.433082580566406,43.540775299072266,35.58948135,39.90536118,44.481098179999996,41.792354580000001,30.28167724609375,33.596199035644531,36.910720825195313,42.376224517822266,47.841728210449219,30.284765239999999,37.770481109999999,44.036891939999997,38.437412260000002,31.080207824707031,35.046833038330078,39.013458251953125,46.383937835693359,39.433082580566406,8.4197524203614904,112.556957554354,12.6206678277343,25.761742559818799,51.241022514904898,7.5671779190837798,7.9994009299479298,27.536569581703201,1.3604037788980501,0.85870385770351498,null,null,21.159467458724976,18.685567617416382,16.383973836898804,48.005889189516601,12.8171247825418,10.1457693990263,9.0187074644348399,12.277752636298001,93,33.098851760182001,109.1,93,13.27,13.93,10.4,10.5,13.8,9.18,9.9700000000000006,6.54,12.4,8.3000000000000007,9.9860000000000007,8.9610000000000003,18.75,21.64,22.566666666666663,21.6,21.55,23.35,21.65,30.5,26.5,9,10.163,9.4060000000000006,8.8000000000000007,12.9,9.1,12.9,9.1,12.2925,12.564,11.5,9.0187074644348399,9.0187074644348399,11.5,14.3,14.3,5.95,14.65,14.3,14.3,14.3,14.65,10.299999999999999,14.65,17,14.9,12.913,7.7759999999999998,12.96,9.0549999999999997,12,9.0549999999999997]
[null,1400,null,86.884876796177394,99.699990503220306,52.372634879515097,1.39256276704784,4.6059999500000002,5.5265650749206543,12.032747268676758,11.353723526000977,10.674699783325195,8.9997415542602539,7.3247833251953125,15.181987762451172,14.639549255371094,14.097110748291016,12.786395072937012,15.596255299999999,14.869821549999999,18.69837952,18.811019900000002,17.987314219999998,19.700767517089844,19.529823303222656,19.358879089355469,18.619943618774414,18.876094819999999,19.81679153,24.274019240000001,26.709671020507813,28.577728271484375,30.445785522460938,26.98623276,29.069664,31.592924119999999,31.0768795,23.934793472290039,26.179908752441406,28.425024032592773,31.716272354125977,35.00752067565918,23.963920590000001,29.471920010000002,33.646888730000001,30.08890152,24.908489227294922,27.738361358642578,30.568233489990234,35.751201629638672,28.577728271484375,5.6735601874760198,115.148442985898,12.924936154129,23.617148849945401,33.261124927883401,7.4197787083072901,6.0704934193118198,29.578100548035898,1.2571450503409201,0.78884561427452804,null,null,14.394677639007568,13.241508007049561,11.420992136001587,49.849995251610153,9.5483368501401795,7.5859515074349897,6.8604186159640097,8.8650009344655594,74,27.723373339055101,111.8,74,8.8800000000000008,9.34,6.6,6.4,11.1,6.89,7.45,5,8.5,5.8,4.7110000000000003,4.7489999999999997,13.43,15.3,16.3,15.649999999999999,15.599999999999998,16.850000000000001,15.149999999999999,18.599999999999998,18.2,6.6666670000000003,7.5869999999999997,6.976,6.6,9.5,6.9,9.6,6.9,9.0487500000000001,9.3190000000000008,8.5,6.8604186159640097,6.8604186159640097,8.5,9.8000000000000007,9.8000000000000007,4.25,5.55,9.8000000000000007,9.8000000000000007,9.8000000000000007,5.55,7.15,5.55,11.2,10.199999999999999,9.5909999999999993,5.7140000000000004,9.7029999999999994,7.093,9.7029999999999994,7.093]
[null,1800,null,59.145562839610903,84.372634270430297,20.012605244470802,0.788048111213832,2.72900009,3.2715094089508057,7.3904132843017578,6.8269343376159668,6.2634553909301758,5.1761984825134277,4.0889415740966797,8.9743213653564453,8.604365348815918,8.2344093322753906,7.2339911460876465,9.0113687519999992,8.6336097719999998,10.50348949,10.51054287,9.9895458220000002,10.929755210876465,10.845381736755371,10.761008262634277,10.301322937011719,10.517024989999999,10.883280750000001,12.914929389999999,14.61003589630127,14.888544082641602,15.167052268981934,14.80760956,15.13154125,16.540407179999999,16.176721570000002,15.133969306945801,15.528033256530762,15.922097206115723,16.527185440063477,17.13227367401123,15.43140316,16.910158160000002,17.62989426,17.73889732,16.840934753417969,17.676689147949219,18.512443542480469,19.585325241088867,14.888544082641602,1.88250832200178,95.954823877690501,8.4118070111605299,13.040570741044,25.318019272515901,3.0414243652788202,4.9003082855502704,16.9453762673411,1.5411322349043599,0.76846824523323698,null,null,8.5783443450927734,7.7416708469390869,6.4477287530899048,42.186317135215148,6.4889491542106601,5.2275300279036498,4.8781218855097004,5.1708301754202104,46,18.3825943044471,98.4,46,4.96,5.38,4.7,4.0999999999999996,8.5,4.34,4.67,3.21,5.2,3.6,2.04,1.972,7.86,9.1,9.8333333333333339,9.3500000000000014,9.3250000000000011,9.9499999999999993,8.9,10.533333333333333,10.3,4,4.5460000000000003,4.141,4,5.7,4.2,5.8,4.2,5.4727500000000004,5.5869999999999997,6,4.8781218855097004,4.8781218855097004,6,5.7,5.7,2.6,5.75,5.7,5.7,5.7,5.75,4.1749999999999998,5.75,6.5,5.8,7.016,3.6659999999999999,6.9850000000000003,4.7489999999999997,6.9850000000000003,4.7489999999999997]
[null,2200,null,24.860419577643899,69.797143809000602,12.1193871726471,0.83864056182194102,1.60599995,1.3216179609298706,4.8363490104675293,4.4509921073913574,4.0656352043151855,2.5302050113677979,0.99477481842041016,5.7750911712646484,5.4859905242919922,5.1968898773193359,4.4857454299926758,5.7897057529999998,5.4278502460000002,6.5749273300000004,6.5056977270000003,6.0411195759999998,6.8585963249206543,6.7526907920837402,6.6467852592468262,6.2171306610107422,6.3811612130000004,6.5425100330000001,7.6657576560000003,8.6602602005004883,8.6876325607299805,8.7150049209594727,8.7633085249999993,8.8064708710000001,9.8019943240000007,9.3120708469999993,8.9171600341796875,9.1302871704101563,9.343414306640625,9.4884853363037109,9.6335563659667969,9.0572147370000007,9.802516937,10.058365820000001,10.191379550000001,9.7759122848510742,10.164765357971191,10.553618431091309,11.028091430664063,8.6876325607299805,2.6536199578217099,87.814298502604103,7.6621321881984796,7.3198618548013501,19.836457689461099,2.8118962513880699,3.3171784492626202,17.6135584563336,1.3924210251819,0.71019445505647505,null,null,5.5404056310653687,4.9140762090682983,3.6130027770996094,34.898571904500301,5.1359898392523302,4.2357990983486298,4.0300390714121104,2.2924072895971102,31,19.586033868409501,72.900000000000006,31,3.05,3.39,1.7,2.2000000000000002,7.4,2.2999999999999998,2.57,1.42,3.5,2.4,1.0329999999999999,1.002,5.03,5.84,6.5333333333333341,6.05,6.0750000000000002,6.4,5.65,6.4666666666666659,6.3,2,2.1829999999999998,2.0049999999999999,2.1,3.5,2.2999999999999998,3.3,2.2999999999999998,3.3355000000000001,3.206,3.5,4.0300390714121104,4.0300390714121104,3.5,3.8,3.8,1.65,3.85,3.8,3.8,3.8,3.85,2.7499999999999996,3.85,4.0999999999999996,3.9,3.8090000000000002,2.93,3.7519999999999998,3.4969999999999999,3.7519999999999998,3.4969999999999999]
[null,2600,null,26.134972138631898,59.414482693445102,5.2806308935845703,0.82303421312784597,1.0559999900000001,0.81321293115615845,2.8340897560119629,2.5240485668182373,2.2140073776245117,1.4638104438781738,0.71361351013183594,3.635664701461792,3.3300714492797852,3.0244781970977783,2.40875244140625,3.9518492219999999,3.207206964,4.3435406680000002,4.2814054490000002,3.5784909730000001,4.5275402069091797,4.4447588920593262,4.3619775772094727,3.722553014755249,3.742574453,4.0015044209999999,4.7841138839999999,5.3469357490539551,5.3262062072753906,5.3054766654968262,5.3964333529999999,5.3861026760000001,6.0109968189999998,5.6295852660000003,5.5156149864196777,5.5944070816040039,5.6731991767883301,5.7068986892700195,5.740598201751709,5.5518198009999997,5.8888211249999998,5.9452919959999999,6.0751690859999998,5.9476666450500488,6.0988092422485352,6.2499518394470215,6.3684892654418945,5.3262062072753906,3.9129266367072102,72.607694989159,6.6522777644628404,9.0185654055995492,14.5951845245415,1.6353603497499001,2.8850152652718601,15.308474345067401,1.12274965037375,3.7295150409905098,null,null,3.4352709650993347,2.8218604922294617,1.9849677085876465,29.707241346722551,4.34329738237233,3.6731815660512899,3.4042600515694299,1.36258554704569,21.5,19.265264666171301,54.8,21.5,1.66,1.92,1.2,1.3,6.8,1.61,1.77,1.07,2.5,1.7,0.63500000000000001,0.52200000000000002,3.62,4.3,4.7,4.3,4.3499999999999996,4.6500000000000004,4.1500000000000004,4.9333333333333336,4.8,2,1.407,1.232,1.4,2.2999999999999998,1.5,2.2000000000000002,1.5,2.1422499999999998,2.093,2.5,3.4042600515694299,3.4042600515694299,2.5,2.8,2.8,1.2,2.8,2.8,2.8,2.8,2.8,2,2.8,3,2.8,2.9780000000000002,2.5609999999999999,2.855,2.7869999999999999,2.855,2.7869999999999999]
[null,3000,null,19.665029366811101,46.217696961902398,3.5275881508574298,0.76968111740425804,0.78799998800000004,0.84292477369308472,2.1367696523666382,1.7877095937728882,1.4386495351791382,0.98147612810134888,0.52430272102355957,2.5629487037658691,2.325244665145874,2.0875406265258789,1.4971621036529541,2.622822523,2.2036323549999999,3.1507306100000001,2.8062326909999999,2.3409883979999999,3.3011822700500488,3.096508264541626,2.8918342590332031,2.4320898056030273,2.408221245,2.6051151749999999,3.2499396800000002,4.1204814910888672,3.9079458713531494,3.6954102516174316,4.1464862819999997,3.9890875819999998,4.2599129680000001,4.3343591689999998,3.7778992652893066,4.0310769081115723,4.2842545509338379,4.4419770240783691,4.5996994972229004,3.9286255840000002,4.274368763,4.7118024829999996,4.3875284189999997,4.209172248840332,4.3570890426635742,4.5050058364868164,4.9209012985229492,3.9079458713531494,4.0970955008552101,54.302401392800398,6.2201537400846201,8.1366631454702194,14.9551387872757,1.7791455881011,2.0582110445528299,10.3745057015354,1.13518827263912,3.6855752477775101,null,null,2.4564039409160614,1.9253178536891937,1.2539472579956055,23.108848480951199,3.8102585119852401,3.1476182891334701,3.0236091544406798,1.0148173119866,16,7.9037076507400101,42.9,16,1.1000000000000001,1.24,0.8,0.7,6.3,1.2,1.31,0.8,1.9,1.3,0.48899999999999999,0.373,2.64,3.26,3.5,3.1500000000000004,3.2,3.45,3.05,3.5333333333333332,3.4,1.6666666666666667,0.89400000000000002,0.79900000000000004,1.1000000000000001,1.7,1.1000000000000001,1.7,1.1000000000000001,1.5620000000000001,1.546,2,3.0236091544406798,3.0236091544406798,2,2.1,2.1,0.9,2.1,2.1,2.1,2.1,2.1,1.5000000000000002,2.1,2.2999999999999998,2.1,2.4060000000000001,2.36,2.2610000000000001,2.4239999999999999,2.2610000000000001,2.4239999999999999]
[null,4000,null,9.59497648420788,23.4533535911923,1.47666281806817,2.5527541894463001E-2,1.2640000600000001,0.56292444467544556,0.90104067325592041,0.84076237678527832,0.78048408031463623,0.71877425909042358,0.65706443786621094,1.0492105484008789,0.99771040678024292,0.94621026515960693,0.88070529699325562,1.2128723859999999,0.98030102299999999,1.433474422,1.242422342,1.094655991,1.5413063764572144,1.3949637413024902,1.2486211061477661,1.1284986734390259,1.229005218,1.2123656270000001,1.4845674040000001,1.6865676641464233,1.6338239908218384,1.5810803174972534,1.701498747,1.6563129430000001,1.792022228,1.7777059079999999,2.9210208654403687,2.3571271896362305,1.7932335138320923,1.8279778957366943,1.8627222776412964,2.6120092869999998,1.925233245,1.9845162629999999,2.6429631709999999,2.93096923828125,2.8424975872039795,2.754025936126709,2.1007661819458008,1.6338239908218384,0,54.661177185603499,6.7863510471313999,7.5983360428908897,12.9921239030795,3.0711263265671001,1.46818862505006,5.8465505597248804,0.879386126057353,0,null,null,1.0121680796146393,0.90477871894836426,0.82479508221149445,11.72667679559615,3.2440625951149902,2.7861909491315799,2.8179511084575202,0.654171269941622,8.4,8.2289104650011193,24.4,8.4,1.26,1.27,0.5,0.4,6.1,0.77,0.84,0.54,1.1000000000000001,0.8,0.32900000000000001,0.24299999999999999,1.53,1.86,1.9666666666666668,1.85,1.825,1.9,1.75,2.1333333333333333,2,1.6666666666666667,0.84899999999999998,0.82799999999999996,0.7,1.1000000000000001,0.7,1.1000000000000001,0.7,1.0057499999999999,1.044,1,2.8179511084575202,2.8179511084575202,1,1.3,1.3,0.6,1.3,1.3,1.3,1.3,1.3,0.95000000000000007,1.3,1.4,1.3,1.2310000000000001,1.605,1.171,1.6539999999999999,1.171,1.6539999999999999]
[null,6000,null,3.78705186304592,10.956361064456701,0.120454657701902,0,0.90600001799999996,0.20043011009693146,0.5218656063079834,0.483406662940979,0.44494771957397461,0.33344349265098572,0.22193926572799683,0.646537184715271,0.60697412490844727,0.56741106510162354,0.47966158390045166,0.637697756,0.590169787,0.71763354499999998,0.70329034300000004,0.63426178700000002,0.73898118734359741,0.7234189510345459,0.70785671472549438,0.64098209142684937,0.72094905399999998,0.67035692899999999,0.72732955200000005,0.84890633821487427,0.79477024078369141,0.74063414335250854,0.85746735299999999,0.78903740600000005,0.90817820999999999,0.81791514200000004,0.97691410779953003,0.9388464093208313,0.90077871084213257,0.83245199918746948,0.7641252875328064,1.1269708869999999,0.93592911999999995,0.84295272799999998,0.97724854900000002,1.2450250387191772,1.116568922996521,0.98811280727386475,0.88732063770294189,0.79477024078369141,0,26.085674424398501,5.1904050767038203,5.1759189277823401,10.7431548066101,1.6475391953623,0.85477385783382898,6.6916516606001597,1.0192914811206399,0.23825205923348899,null,null,0.6153692901134491,0.5367952287197113,0.41523100435733795,5.4781805322283503,2.7143613902630901,2.6768316935998602,2.7594653365307602,0.47671886833900401,3.5,0,11.3,3.5,1.45,1.46,0.2,0.3,5.8,0.61,0.64,0.49,0.6,0.5,0.26600000000000001,0.189,0.9,1.08,1.2666666666666668,1.1000000000000001,1.125,1.4,1.05,1.2666666666666666,1.2,1.6666666666666667,0.93200000000000005,0.93,0.5,0.7,0.5,0.7,0.5,0.64775000000000005,0.64700000000000002,2,2.7594653365307602,2.7594653365307602,1,0.7,0.7,0.4,0.7,0.7,0.7,0.7,0.7,0.54999999999999993,0.7,0.7,0.7,0.72299999999999998,1.212,1.171,1.6539999999999999,1.171,1.6539999999999999]
[null,8000,null,1.7732642829418099,5.8783457914988198,0,0,0.72399997699999996,0,0.36383810639381409,0.29974275827407837,0.23564741015434265,0.10404429584741592,-2.7558818459510803E-2,0.45129916071891785,0.39545226097106934,0.33960536122322083,0.19826593995094299,0.44937631500000003,0.36176258300000003,0.484042525,0.42496791499999997,0.28203746699999999,0.51055806875228882,0.47419992089271545,0.43784177303314209,0.28589910268783569,0.32323950499999998,0.28696057200000002,0.279565811,0.45395362377166748,0.26786071062088013,8.1767797470092773E-2,0.45357734,0.27089595799999999,0.317575157,0.26630821799999999,0.56381329894065857,0.50426667928695679,0.444720059633255,0.24686558544635773,4.9011111259460449E-2,0.52530986099999999,0.42897352599999999,0.23602414099999999,0.41551464799999999,0.52917751669883728,0.46943268179893494,0.40968784689903259,0.18418365716934204,0.26786071062088013,0,14.348991033009099,2.9795052296268301,4.0558055839511304,9.5275826443937301,2.1659956744066799,0.39573844924324098,2.4300316942854301,1.11544499705228,0.356828071443057,null,null,0.42943389713764191,0.31361587345600128,0.14180975034832954,2.9391728957494099,null,null,null,null,0,0,7.5,0,1.55,1.57,0.4,0.5,0,0.56999999999999995,0.6,0.46,0.5,0.4,0.28299999999999997,0.2,0.94,0.98,1.0999999999999999,1,0.97499999999999998,1.65,1,1.2666666666666666,1.1000000000000001,1.6666666666666667,0.95799999999999996,0.96,0.5,0.6,0.5,0.6,0.5,0.59550000000000003,0.58199999999999996,1,0,0,1,0.6,0.6,0.4,0.6,0.6,0.6,0.6,0.6,0.5,0.6,0.5,0.6,0.50600000000000001,0.59299999999999997,1.171,1.6539999999999999,1.171,1.6539999999999999]
[null,10000,null,0.81181857805876501,3.5817605330830502,0,0,0.60699999299999996,0,0.24521391093730927,0.16761714220046997,9.0020373463630676E-2,0,-9.0020373463630676E-2,0.30314162373542786,0.24380795657634735,0.18447428941726685,2.3237179964780807E-2,0.31710943600000002,0.18766933699999999,0.33458307399999998,0.21839156700000001,3.7045315000000002E-2,0.36176089942455292,0.29086434841156006,0.2199677973985672,3.3281769603490829E-2,6.3352308999999996E-2,2.6313011000000001E-2,null,0.13212496042251587,0,-0.13212496042251587,0.13664548100000001,null,null,null,0.31043688952922821,0.20305660367012024,9.5676317811012268E-2,0,-9.5676317811012268E-2,0.24086099899999999,4.4387124E-2,null,null,0.23147660493850708,0.11573830246925354,0,0,0,0,8.1750635822613997,1.7885044213275201,4.6868590326970399,5.9083417043079196,3.3432001507830398,0.60687069730131504,2.6743153736708898,1.1796507048815199,0.38576911593750202,null,null,0.28865969553589821,0.1608608104288578,-5.0772083923220634E-3,1.7908802665415251,null,null,null,null,0,0,5.4,0,1.63,1.67,0.3,0.5,0,0.54,0.56999999999999995,0.44,0.4,0.3,0.33300000000000002,0.219,0.97,1,1.0666666666666667,1,0.95,1.65,1.05,1.3666666666666665,1.2,1.6666666666666667,0.98199999999999998,0.98799999999999999,0.4,0.6,0.4,0.6,0.4,0.57125000000000004,0.56100000000000005,1,0,0,1,0.5,0.5,0.35,0.5,0.5,0.5,0.5,0.5,0.42500000000000004,0.5,0.4,0.5,0.40100000000000002,0.621,1.171,1.6539999999999999,1.171,1.6539999999999999]
[]
["Wheelset 2",200,null,293.67733851464698,208.57655475137,259.419836379331,208.80417552001501,286.199005,0,0,0,0,0,0,0,0,0,0,null,null,null,null,null,0,0,0,0,null,null,null,0,0,0,null,null,null,null,0,0,0,0,0,null,null,null,null,0,0,0,0,0,560.60713755710901,303.20965465178801,40.406959321183102,5.2448149638996098,152.80984672186401,69.9057920691085,65.707318486833501,157.50911290649199,84.481391836134193,278.66419287667497,null,null,{"$f":"J21+(O21-J21)*0.75","v":0},{"$f":"L21+(Q21-L21)*0.75","v":0},{"$f":"N21+(R21-N21)*0.75","v":0},{"$f":"E21/2","v":104.288277375685},null,null,null,null,null,123.04173235703701,110.5,195,0,0,53.7,43.4,0,0,0,0,18.600000000000001,15.2,79.08,64.248000000000005,107.56,96.98,112.66666666666667,106.6,108.64999999999999,119.6,109.6,127.56666666666668,121.9,35,153.01900000000001,140.55699999999999,0,0,0,0,0,0,0,54,0,0,60.5,33.1,33.1,23.15,33.200000000000003,33.1,33.1,33.1,33.200000000000003,28.175000000000004,33.200000000000003,35.700000000000003,33.5,34.334000000000003,35.351999999999997,34.198999999999998,36.963999999999999,34.198999999999998,36.963999999999999]
[null,400,null,52.103449545664098,159.05525172557901,119.23445018433399,23.0171892474727,44.419998200000002,0,0,0,0,0,0,0,0,0,0,null,null,null,null,null,0,0,0,0,null,null,null,0,0,0,null,null,null,null,0,0,0,0,0,null,null,null,null,0,0,0,0,0,291.32188575573701,74.494362254249495,9.46429740254111,1.56479778865323,7.7503874712269401,6.52553513866693,6.7953719009425599,7.9045259287763496,21.196797392576698,60.056153160450599,null,null,{"$f":"J22+(O22-J22)*0.75","v":0},{"$f":"L22+(Q22-L22)*0.75","v":0},{"$f":"N22+(R22-N22)*0.75","v":0},{"$f":"E22/2","v":79.527625862789506},4.1675434278381296,4.1149103043105102,4.38281883357224,3.5717540902974001,24,22.493415615699401,105.2,24,7.53,7.77,0.9,1.1000000000000001,10.4,2.21,2.3199999999999998,1.79,6.1,4.7,0.377,0.13900000000000001,3.13,3.76,3.6333333333333333,3.3499999999999996,3.3250000000000002,3.8,3.55,4.5,4.4000000000000004,6.333333333333333,60.073,53.524000000000001,2.1,2.8,2.2000000000000002,3,2.2000000000000002,2.6062500000000002,2.84,5.5,4.38281883357224,4.38281883357224,5,7.5,7.5,5.25,7.2,7.5,7.5,7.5,7.2,6.2249999999999996,7.2,6.5,7.1,3.2029999999999998,0.247,4.2949999999999999,0.26800000000000002,4.2949999999999999,0.26800000000000002]
[null,600,null,1.34251493167222,67.302767881511201,35.9395222498066,5.0531314210720799,19.3379993,0.33291953802108765,0.60750222206115723,0.7853735089302063,0.96324479579925537,0.98521316051483154,1.0071815252304077,0.34633862972259521,0.42513471841812134,0.50393080711364746,0.59366810321807861,0.30171170800000002,0.42540296900000002,0.19899956899999999,0.23595164699999999,0.229468599,0.19227734208106995,0.20871219038963318,0.22514703869819641,0.21451519429683685,0.12762378199999999,0.18753747600000001,0.11567632899999999,0.10336911678314209,8.1367261707782745E-2,5.9365406632423401E-2,0.10157949500000001,null,null,null,0.19137616455554962,9.5688082277774811E-2,0,0,0,null,null,null,null,0,0,0,0,8.1367261707782745E-2,153.45051710827201,0.58998928528165195,1.8158238951599599,0.57195912205758404,0,0.20288273035003901,0.70106216731262405,0.41560472792958503,0.83003648110910799,1.8520098466431401,null,null,0.41162952780723572,0.61875930428504944,0.69704645872116089,33.651383940755601,1.35068427657085,1.31036087663293,1.5431957290226801,1.44381513457234,4.2,0.23671045952080799,78.5,4.2,0.25,0.17,4.8,5.6,10,0.88,0.92,0.73,6.4,4.2,3.278,3.9510000000000001,2.37,2.34,2.5666666666666669,2.8499999999999996,2.9499999999999997,2.75,3.35,3.7333333333333329,3.6,11,53.204999999999998,47.529000000000003,0.9,1.3,0.9,1.2,0.9,1.1472500000000001,1.147,3,1.5431957290226801,1.5431957290226801,6,5.6,5.6,1.95,5.05,5.6,5.6,5.6,5.05,3.5,5.05,3.7,4.8,1.4019999999999999,2.762,1.8360000000000001,2.2269999999999999,1.8360000000000001,2.2269999999999999]
[null,800,null,0,43.536623716526002,23.216871647013399,2.9565134919132299,10.9569998,5.9381589293479919E-2,3.3403582572937012,2.8694117069244385,2.3984651565551758,1.5081223249435425,0.61777949333190918,7.9523630142211914,5.5072317123413086,3.0621004104614258,2.1545853614807129,5.8111510280000003,5.3278107639999996,6.2769470209999998,5.9033865929999996,4.9931836130000002,6.4487204551696777,6.209169864654541,5.9696192741394043,5.0775852203369141,3.9012010099999999,5.2303357119999996,5.7264199260000002,6.7656478881835938,6.1161842346191406,5.4667205810546875,6.7986693379999998,6.1607108119999996,4.8995671270000001,6.3429951669999998,7.3112373352050781,7.1436481475830078,6.9760589599609375,6.4026026725769043,5.8291463851928711,7.1954956049999996,7.0054569239999998,6.4477515219999999,7.0088376999999999,7.4580659866333008,7.2363066673278809,7.0145473480224609,6.4027042388916016,6.1161842346191406,159.49636019108701,1.1552366686862801,0,5.2528025198321504E-3,0,1.55614335988254,1.22266376083824,0,0.98419672216669196,0.64090550310891703,null,null,6.7993618249893188,2.8961915969848633,1.770383894443512,21.768311858263001,1.8293350024533299,1.6597285935450501,1.7092648511923101,0.86923263611486701,0.5,1.94664713273544,78.8,0.5,0.36,0.43,3.2,4.2,9.1,0.65,0.76,0.34,4.9000000000000004,2.5,3.2320000000000002,3.3959999999999999,3.18,3.74,3.3333333333333335,3.3499999999999996,3.5750000000000002,3.6500000000000004,4.75,5.8,5.8,5,28.818000000000001,24.870999999999999,0.9,1.4,0.9,1.2,0.9,1.3125,1.1379999999999999,0.7,1.7092648511923101,1.7092648511923101,4.5,3.9,3.9,1.1000000000000001,3.75,3.9,3.9,3.9,3.75,2.4249999999999998,3.75,2.7,3.7,1.089,1.544,1.33,1.2230000000000001,1.33,1.2230000000000001]
[null,1000,null,5.11323328163963,10.1173460700295,5.1335180918375602,2.05584606467461,7.1030001599999997,0.58748894929885864,3.1888309121131897,2.0873868465423584,0.9859427809715271,0.49185425043106079,-2.2342801094055176E-3,7.7752993106842041,5.2282557487487793,2.6812121868133545,1.1874074935913086,5.9889502529999996,2.9722650050000001,6.6868577,5.7201704979999999,4.509825706,7.0302038192749023,6.4335231781005859,5.8368425369262695,4.6260919570922852,2.0981504919999998,4.8347306249999997,5.5230550770000004,7.343353271484375,6.0933794975280762,4.8434057235717773,7.4109191890000004,6.1576628680000001,4.8918414119999998,6.420853138,8.0499372482299805,7.8934931755065918,7.7370491027832031,6.5050926208496094,5.2731361389160156,8.1557855610000001,7.9067635540000003,6.7641725539999999,8.0453119280000003,8.5060081481933594,8.3421764373779297,8.1783447265625,7.1735730171203613,6.0933794975280762,138.44280005383601,6.0247278505050597,0,1.35926242757804E-3,1.95210140319097,3.2821021678496298,2.1881594059418599,1.2594653024965401,1.05724032921573,0.29983075350641603,null,null,6.6286822110414505,2.2573948353528976,0.88999705016613007,5.05867303501475,2.0719057016053299,1.71656478642446,1.74336043085961,0.60445826147653703,1.2,3.5634850824540401,81.400000000000006,1.2,0.22,0.21,1.9,2.9,8,0.43,0.5,0.22,3.8,2.2000000000000002,1.2290000000000001,1.9490000000000001,1.96,2.82,2.2000000000000002,2.1,2.1749999999999998,2.4,3.0999999999999996,4.1000000000000005,4.0999999999999996,5,15.164,13.914,0.5,1,0.6,0.8,0.6,0.88800000000000001,0.81,0.8,1.74336043085961,1.74336043085961,3,3.1,3.1,1.1499999999999999,2.85,3.1,3.1,3.1,2.85,2,2.85,2.2000000000000002,2.7,0.88400000000000001,0.47099999999999997,1.0760000000000001,0.34599999999999997,1.0760000000000001,0.34599999999999997]
[null,1200,null,8.3894024517590804,2.5836242641300902,1.4883091633791901,1.5306418960736901,4.9850001300000004,0.67155104875564575,1.3084667325019836,1.1325514316558838,0.95663613080978394,0.74326342344284058,0.52989071607589722,2.2351982593536377,1.7850461006164551,1.3348939418792725,0.99214780330657959,2.8343331809999999,1.451184273,4.5418276789999998,2.5942313669999999,1.572204113,4.7005815505981445,3.7648177146911621,2.8290538787841797,1.6381111145019531,1.492012143,1.8482189179999999,3.2233278749999998,5.465975284576416,4.1779532432556152,2.8899312019348145,5.5705909729999998,4.2820086479999997,3.527131319,4.7255706789999996,7.1401686668395996,6.6371383666992188,6.1341080665588379,4.8905420303344727,3.6469759941101074,7.297230721,6.5493326190000003,5.4082527159999998,6.8853783609999999,7.8835458755493164,7.5305676460266113,7.1775894165039063,6.2956466674804688,4.1779532432556152,107.503921179123,17.183586485591899,0,0.41951192234821799,4.4878971806758603,2.1622474905931499,1.76478077157043,3.0622303127986799,1.0159347727544601,0.66401230698347802,null,null,2.0035153776407242,1.2403294891119003,0.876583531498909,1.2918121320650451,2.12495509710436,1.8132424359138499,1.87051185150987,1.24255698065006,2.5,4.2135505783004197,65.3,2.5,0.26,0.17,1.4,2.4,7.3,0.28000000000000003,0.33,0.16,3.1,1.8,0.71099999999999997,0.69,1.76,2.2000000000000002,1.8999999999999997,1.75,1.9,2.1,2.25,2.7000000000000006,2.6,5,10.606999999999999,9.7690000000000001,0.4,0.6,0.4,0.5,0.4,0.58150000000000002,0.497,3,1.87051185150987,1.87051185150987,3,2.8,2.8,0.85,2.65,2.8,2.8,2.8,2.65,1.7500000000000002,2.65,2,2.6,0.79400000000000004,0.51200000000000001,0.93500000000000005,0.44800000000000001,0.93500000000000005,0.44800000000000001]
[null,1400,null,6.24573798497517,5.8732937414731297E-2,0.55515103117749898,1.4333966109180001,3.64899993,0.83488953113555908,1.4757349491119385,1.2545115947723389,1.0332882404327393,0.92847633361816406,0.82366442680358887,1.7180577516555786,1.5772600173950195,1.4364622831344604,0.99371099472045898,1.6186068060000001,1.5113477710000001,2.5388100150000001,1.8312162160000001,1.5902502540000001,2.4548704624176025,2.158076286315918,1.8612821102142334,1.6486430168151855,1.2564356329999999,1.7582454679999999,2.1122512819999999,3.2551968097686768,2.5350232124328613,1.8148496150970459,3.3287558559999999,2.6135368350000001,2.4515464310000001,2.9414551260000001,4.4556708335876465,4.0916123390197754,3.7275538444519043,3.0480468273162842,2.3685398101806641,4.7135453219999999,4.0205545430000003,3.3772270679999998,4.3290658000000004,5.1548442840576172,4.8888130187988281,4.6227817535400391,4.0690159797668457,2.5350232124328613,64.667710465930696,20.812665717715301,0.32561519009202899,0.86928550497474899,6.8317516577763504,2.2642459579669501,1.25172729855183,4.8762052725518501,0.99703728676387304,0.661783372518018,null,null,1.6574770510196686,1.3356687724590302,0.95119935274124146,2.9366468707365648E-2,2.18191756981581,1.87070781953554,1.87579150712029,1.42229539141869,2.7,4.7625593938999504,49,2.7,0.31,0.22,2.1,1.5,6.8,0.28999999999999998,0.33,0.19,2.4,1.4,0.54100000000000004,0.379,1.43,1.86,1.5333333333333332,1.45,1.575,1.7,2.1,2.5333333333333332,2.5,5,7.9359999999999999,7.2759999999999998,0.4,0.6,0.4,0.5,0.4,0.52500000000000002,0.45700000000000002,3,1.87579150712029,1.87579150712029,3,2.1,2.1,0.6,2.1,2.1,2.1,2.1,2.1,1.3499999999999999,2.1,2,2.1,0.83599999999999997,0.57899999999999996,0.96299999999999997,0.505,0.96299999999999997,0.505]
[null,1800,null,10.3552462630287,4.3911364580049401,0.92420274206704101,0.90710959715064299,1.7699999799999999,1.1355129480361938,1.5446358919143677,1.4012398719787598,1.2578438520431519,1.3877164125442505,1.5175889730453491,2.03592848777771,1.8050248622894287,1.5741212368011475,1.4996916055679321,1.8582464460000001,1.647918105,2.0221619610000001,1.991808534,1.643203974,2.0872712135314941,2.0532894134521484,2.0193076133728027,1.6522374153137207,1.5822840929999999,1.7210692169999999,2.1220173839999998,2.4175052642822266,2.3464875221252441,2.2754697799682617,2.437362432,2.370738029,2.1103868480000001,2.4723772999999998,2.380723237991333,2.4659743309020996,2.5512254238128662,2.5059185028076172,2.4606115818023682,2.3504328729999999,2.6293694969999999,2.6111903189999999,2.6765296460000001,2.4502198696136475,2.5847179889678955,2.7192161083221436,2.8134806156158447,2.3464875221252441,36.888017738778402,21.055578176257601,0.36902089258276399,1.75875357707284,6.3835166368082303,0.535178201721769,1.15715875090489,1.8623832118264001,1.10308044756284,0.89586142209941899,null,null,1.9131053388118744,1.4950518906116486,1.5041659474372864,2.1955682290024701,2.1745892900355202,1.92469745320848,1.9779641805752799,1.9061803378892901,2.4,6.3825350069173696,31.2,2.4,0.59,0.56000000000000005,1.6,1.6,6.4,0.56000000000000005,0.64,0.33,1.4,0.8,0.48399999999999999,0.44500000000000001,1.39,1.7,1.4666666666666668,1.4,1.5,1.6,1.95,2.3666666666666667,2.2999999999999998,3,4.8600000000000003,4.3579999999999997,0.5,0.7,0.5,0.6,0.5,0.62149999999999994,0.57299999999999995,3.5,1.9779641805752799,1.9779641805752799,3.5,1.2,1.2,0.45,1.2,1.2,1.2,1.2,1.2,0.82499999999999996,1.2,1.1000000000000001,1.2,1.079,0.873,1.101,0.72399999999999998,1.101,0.72399999999999998]
[null,2200,null,11.771520939327401,1.7189285967321599,0.15770516091367801,0.85666049671595002,1.2729999999999999,0.66573542356491089,1.5237828493118286,1.5469114780426025,1.5700401067733765,0.81245160102844238,5.4863095283508301E-2,2.0296633243560791,1.9162042140960693,1.8027451038360596,1.9006665945053101,2.0823817249999999,1.852508187,2.1821286679999998,2.1508157250000002,2.1456143860000001,2.3241326808929443,2.2617697715759277,2.1994068622589111,2.1730256080627441,2.1454877849999998,2.2237482069999999,2.4029026029999998,2.5173685550689697,2.5725595951080322,2.6277506351470947,2.5287907120000002,2.5909650329999998,2.4632012840000002,2.6454446319999998,2.4744088649749756,2.5332684516906738,2.5921280384063721,2.6451129913330078,2.6980979442596436,2.4616062639999998,2.6413469310000002,2.690817595,2.6805996890000001,2.5773096084594727,2.6469132900238037,2.7165169715881348,2.7861616611480713,2.5725595951080322,26.569043347948998,21.930319263821499,0.81401455278819201,2.0979202458311401,4.3146253940972201,0.58438737674471797,0.62742687728764501,3.6399144604855298,1.0123538140453401,0.81176081775222297,null,null,1.9031932055950165,1.7445688545703888,1.4392157196998596,0.85946429836607996,2.1600339878600399,1.9355528041155701,2.0603668787220002,1.05816797751216,1.5,9.3256974741909708,20.3,1.5,0.93,0.91,1.3,0.8,6.2,0.46,0.52,0.26,0.9,0.8,0.46300000000000002,0.375,1.48,1.7,1.6333333333333335,1.55,1.625,1.75,2,2.4,2.4,2,2.4409999999999998,2.1619999999999999,0.2,0.6,0.2,0.3,0.2,0.43274999999999997,0.29399999999999998,2,2.0603668787220002,2.0603668787220002,2,0.8,0.8,0.6,0.8,0.8,0.8,0.8,0.8,0.70000000000000007,0.8,0.7,0.8,0.58699999999999997,1.099,0.61399999999999999,0.93100000000000005,0.61399999999999999,0.93100000000000005]
[null,2600,null,12.4226596559797,1.5902376006046901,0.13484054482298699,0.80476358138924098,0.92599999899999996,0.20084458589553833,0.52061522006988525,0.64557301998138428,0.7705308198928833,0.87967312335968018,0.98881542682647705,0.86070698499679565,0.79845511913299561,0.73620325326919556,0.98870384693145752,2.2429406639999998,0.72776943400000005,2.353134394,2.374683857,0.93565237499999998,2.4888129234313965,2.4489707946777344,2.4091286659240723,0.92950558662414551,1.1378467080000001,1.0295536519999999,2.7692878250000001,2.693223237991333,2.9691150188446045,3.245006799697876,2.6999299529999998,2.991766691,2.9620230200000002,3.0873367790000001,2.5565719604492188,2.6474118232727051,2.7382516860961914,3.1185877323150635,3.4989237785339355,2.5374619960000002,2.7683882710000001,3.2068433760000001,2.7937126160000001,2.6146008968353271,2.7158007621765137,2.8170006275177002,3.2359397411346436,2.9691150188446045,17.204298312323399,23.477715480895199,1.00156856656841,2.53802227616054,1.7939128737691601,0.206497169099082,0.64259875817670398,2.9834840676032899,0.864197978844232,5.8865429188636602,null,null,0.77568404376506805,0.74478514492511749,0.9887317419052124,0.79511880030234505,2.0864591964482702,1.96783360454885,2.0444422722256701,1.1476293099379999,1.1000000000000001,9.4405619787733706,14.4,1.1000000000000001,1.02,0.99,0.6,0.5,6.1,0.34,0.35,0.28000000000000003,1,0.7,0.47899999999999998,0.38900000000000001,0.35,0.82,0.6333333333333333,0.5,0.5,0.5,0.9,1.1333333333333333,1.2,2.3333330000000001,1.627,1.393,0.2,0.3,0.2,0.4,0.2,0.28949999999999998,0.36,2,2.0444422722256701,2.0444422722256701,2,1.1000000000000001,1.1000000000000001,0.5,1,1.1000000000000001,1.1000000000000001,1.1000000000000001,1,0.75,1,1,1,0.42699999999999999,0.47299999999999998,0.42899999999999999,0.37,0.42899999999999999,0.37]
[null,3000,null,9.5162277982348495,1.56525024445284,0.103454088253531,0.72985485576685105,0.70599997000000003,0.20616596937179565,0.77539926767349243,0.77766025066375732,0.77992123365402222,0.28880962729454041,-0.20230197906494141,0.65528267621994019,0.78669154644012451,0.91810041666030884,1.0132724046707153,0.80365568399999998,0.91388297100000004,0.89487802999999999,0.89219957599999999,1.1552879810000001,0.86424815654754639,0.87645518779754639,0.88866221904754639,1.1534593105316162,1.2839829920000001,1.148860097,1.120376348,1.1270737648010254,1.0872888565063477,1.0475039482116699,1.177724481,1.083000422,1.29434216,1.0692902799999999,2.4901597499847412,1.9910467863082886,1.4919338226318359,1.0789084434509277,0.66588306427001953,2.0618841649999999,1.9490298029999999,1.200058222,2.0170114039999998,2.1366486549377441,2.1107380390167236,2.0848274230957031,1.597833514213562,1.0872888565063477,11.5209744987033,24.616973247982202,1.2599657551572501,2.1282612822411902,2.9451404739227098,0.34174289794544199,0.41828735979051501,0.91272593481869502,0.86445243366836599,5.9590594681749298,null,null,0.68531182408332825,0.88355562090873718,0.70937880873680115,0.78262512222642,2.0201369088118102,1.92937002684866,2.0319907580824901,0.72932574912113801,1,5.3557173183852402,10.4,1,1.06,1.19,0.4,0.3,5.9,0.44,0.45,0.38,0.9,0.6,0.502,0.40699999999999997,0.38,0.42,0.5,0.5,0.5,0.6,0.6,0.9,1,2,0.95,0.85199999999999998,0.2,0.4,0.2,0.4,0.2,0.32650000000000001,0.39700000000000002,1,2.0319907580824901,2.0319907580824901,1,0.9,0.9,0.5,0.9,0.9,0.9,0.9,0.9,0.7,0.9,0.8,0.9,0.309,0.47799999999999998,0.25800000000000001,0.38100000000000001,0.25800000000000001,0.38100000000000001]
[null,4000,null,1.80826845367749,0,0,0.10562481755141701,0.72699999800000004,0.17643159627914429,0.39199885725975037,0.35625836253166199,0.32051786780357361,0.39682060480117798,0.47312334179878235,0.10461720824241638,0.26013103127479553,0.41564485430717468,0.57603937387466431,0.52531540399999999,0.395318061,0.92005497199999997,0.45920407800000002,0.53356021600000003,0.97765660285949707,0.74317723512649536,0.50869786739349365,0.53002619743347168,0.61884951600000004,0.522964239,0.67507946500000005,1.1594498157501221,0.99423795938491821,0.82902610301971436,1.1692762370000001,1.0397534369999999,1.106611609,1.170822263,0.74157404899597168,0.98541176319122314,1.2292494773864746,1.1769518852233887,1.1246542930603027,1.5087770220000001,1.1965608599999999,1.2073819640000001,1.011641741,1.9660511016845703,1.6980559825897217,1.430060863494873,1.3126124143600464,0.99423795938491821,2.4075269477707999,17.054392053967401,2.0739396093912501,2.5968513573979801,3.8811297162760101,1.0691003012520801,9.8900946545507101E-2,0,0.82312579488561699,0.20321655824058199,null,null,0.17646262049674988,0.39186310768127441,0.55031036585569382,0,2.1742957680024602,1.98657588606332,2.0915630145073099,0.84923802546138705,1,4.6832722975758401,5.7,1,1.2,1.22,0.5,0.4,5.9,0.4,0.42,0.31,0.7,0.5,0.51400000000000001,0.4,0.35,0.48,0.53333333333333333,0.5,0.47499999999999998,0.5,0.4,0.83333333333333337,0.7,2.3333330000000001,0.84699999999999998,0.84299999999999997,0.3,0.5,0.3,0.5,0.3,0.43225000000000002,0.50600000000000001,2,2.0915630145073099,2.0915630145073099,1.5,0.8,0.8,0.4,0.8,0.8,0.8,0.8,0.8,0.6,0.8,0.8,0.8,0.53700000000000003,0.315,0.57499999999999996,0.252,0.57499999999999996,0.252]
[null,6000,null,1.30338468196846,0,0,0,0.52999997099999996,0.21385881304740906,0.3331153392791748,0.34963428974151611,0.36615324020385742,0.49862241744995117,0.63109159469604492,0.43578994274139404,0.46575656533241272,0.4957231879234314,0.62550193071365356,0.48453044899999997,0.51897245599999997,0.57709503200000001,0.63108980699999995,0.76634752799999994,0.56819498538970947,0.60350322723388672,0.63881146907806396,0.78605085611343384,0.91291010399999994,0.80866068599999996,0.88369232399999997,0.8072088360786438,0.93895214796066284,1.0706954598426819,0.80038809799999999,0.93453460899999996,1.073271155,0.96736735100000004,0.75563329458236694,0.81338179111480713,0.87113028764724731,0.97556215524673462,1.0799940228462219,0.86569923199999999,0.90945923299999998,1.0209161040000001,0.94311726100000004,0.85938316583633423,0.91408884525299072,0.96879452466964722,1.094901442527771,0.93895214796066284,0,10.5218196607771,1.9921615741523799,3.2276734286670199,4.3580773249960796,0.63086912940669704,1.8096822749003101E-2,1.8039956695271699,0.91722757108532305,0.73561214937991604,null,null,0.41012129187583923,0.4633307009935379,0.6268993467092514,0,2.1464886435131101,2.06623162005108,2.16882806813175,1.0262177420688301,0.5,0,3.5,0.5,1.33,1.38,0.6,0.2,5.7,0.56999999999999995,0.6,0.47,0.5,0.4,0.42399999999999999,0.318,0.73,0.84,0.6333333333333333,0.6,0.55000000000000004,1.5,0.75,1.2333333333333334,0.6,2.3333330000000001,0.90700000000000003,0.91200000000000003,0.4,0.5,0.4,0.5,0.4,0.55325000000000002,0.54100000000000004,2.5,2.16882806813175,2.16882806813175,2,0.6,0.6,0.4,0.55000000000000004,0.6,0.6,0.6,0.55000000000000004,0.47499999999999998,0.55000000000000004,0.5,0.5,0.439,0.05,0.57499999999999996,0.252,0.57499999999999996,0.252]
[null,8000,null,0.64576891760031296,0,0,0,0.474000007,0.23110458254814148,0.39162755012512207,0.408407062292099,0.42518657445907593,0.55237400531768799,0.67956143617630005,0.47667610645294189,0.51920396089553833,0.56173181533813477,0.752288818359375,0.51581871499999998,0.59249180599999995,0.62048196799999999,0.71672689899999997,0.91020321800000004,0.60353010892868042,0.66825157403945923,0.73297303915023804,0.92491382360458374,1.092821598,0.95341539399999997,1.0412660840000001,0.86925947666168213,1.1260197162628174,1.3827799558639526,0.87922781699999997,1.141190648,1.3277829889999999,1.194533348,0.74799877405166626,0.83210277557373047,0.91620677709579468,1.2158737182617188,1.5155406594276428,0.81198203599999996,0.933803618,1.288679838,0.96706449999999999,0.8051413893699646,0.89803928136825562,0.99093717336654663,1.3637007474899292,1.1260197162628174,0,6.6690939960025597,1.0975905394366601,3.6871678534365202,4.5836252944651799,1.47465745108321,0,0,0.96023896842788203,0.84067217632691404,null,null,0.45541396737098694,0.52759550511837006,0.73410697281360626,0,null,null,null,null,0,0,1.9,0,1.49,1.57,0.3,0.1,0,0.63,0.67,0.49,0.4,0.3,0.44,0.29499999999999998,1.24,1.1200000000000001,1,0.9,0.9,2.25,1.25,1.6666666666666667,1.2,2.3333330000000001,0.93300000000000005,0.93200000000000005,0.5,0.6,0.5,0.6,0.5,0.65500000000000003,0.60899999999999999,2,0,0,2,0.5,0.5,0.4,0.5,0.5,0.5,0.5,0.5,0.44999999999999996,0.5,0.4,0.5,0.41499999999999998,0.127,0.57499999999999996,0.252,0.57499999999999996,0.252]
[null,10000,null,0.23339688880812501,0,0,0,0.42300000799999998,0.26411652565002441,0.36888182163238525,0.408191978931427,0.44750213623046875,0.57188123464584351,0.69626033306121826,0.48825764656066895,0.56132835149765015,0.63439905643463135,0.85458469390869141,0.549575865,0.67686486199999996,0.65523117799999997,0.80138373399999996,1.0427561999999999,0.65366059541702271,0.73751473426818848,0.82136887311935425,1.0618700981140137,1.2315765620000001,1.0989929439999999,1.24360168,0.99520677328109741,1.3865997791290283,1.7779927849769592,0.99866038599999996,1.402879596,1.64291513,1.470005512,0.74581468105316162,0.91149896383285522,1.0771832466125488,1.4896657466888428,1.9021482467651367,0.83660888700000002,1.1449061629999999,1.5614173410000001,1.184032559,0.79566550254821777,1.001649022102356,1.2076325416564941,1.6964575052261353,1.3865997791290283,0,4.9425495425860104,0.720264246968221,3.69658250788265,2.5141341321548398,2.65050197972637,0.196504627369296,0.230335605259534,0.983575685546345,0.88789747008837405,null,null,0.45841369032859802,0.5876748263835907,0.81500360369682312,0,null,null,null,null,0,0,1.1000000000000001,0,1.64,1.72,0.2,0.3,0,0.66,0.7,0.51,0.4,0.3,0.504,0.31900000000000001,1.46,1.38,1.2333333333333334,1.1000000000000001,1.1000000000000001,2.8,1.45,1.9666666666666668,1.4,2.3333330000000001,0.96,0.95799999999999996,0.6,0.6,0.5,0.6,0.5,0.69825000000000004,0.64700000000000002,2,0,0,2,0.5,0.5,0.4,0.5,0.5,0.5,0.5,0.5,0.44999999999999996,0.5,0.4,0.5,0.41,5.1999999999999998E-2,0.57499999999999996,0.252,0.57499999999999996,0.252]
[]
["Wheelset 3",200,null,663.04565770359,330.921179106907,372.25973997537,197.49698202054799,null,{"$f":"I5","v":158.98587036132813},149.58293151855469,164.25064086914063,178.91835021972656,203.25019836425781,227.58204650878906,154.31181335449219,173.1998291015625,192.08784484863281,222.37841796875,154.24610899999999,193.8979492,159.83790590000001,202.86097720000001,243.19850159999999,161.56285095214844,182.67265319824219,203.78245544433594,244.87234497070313,280.41659550000003,247.867569,257.42016599999999,217.53550720214844,263.48764038085938,309.43977355957031,218.12760929999999,264.52145389999998,312.7772827,268.5058899,170.596435546875,195.87808227539063,221.15972900390625,269.795654296875,318.43157958984375,169.62133789999999,223.2370148,272.91873170000002,224.8818359,171.05290222167969,198.71234130859375,226.37178039550781,277.9349365234375,263.48764038085938,null,560.60713755710901,203.39426188708401,63.979114254932597,417.87665064331202,119.254309035581,138.951696326779,414.21773453107102,null,null,null,null,{"$f":"J37+(O37-J37)*0.75","v":153.12959289550781},{"$f":"L37+(Q37-L37)*0.75","v":188.79547119140625},{"$f":"N37+(R37-N37)*0.75","v":223.67932510375977},{"$f":"E37/2","v":165.4605895534535},151.186381936765,171.89818383626201,190.521908573936,207.077789770061,450,null,432.8,450,222.42,234.19,127.7,111.7,187.7,143.22,147.51,102.73,172.7,133.9,95.597999999999999,53.121000000000002,153.63999999999999,149.12,186.73333333333335,192.05,193.8,171.35,154.19999999999999,179.6,169.3,null,142.679,127.88500000000001,105,145.5,120.6,143.80000000000001,120.6,142.172,113.79,118,null,null,null,214.9,214.9,142.19999999999999,208.85,214.9,214.9,214.9,208.85,175.52499999999998,208.85,189.8,206.1,177.46,48.91,193.422,59.296999999999997,193.422,59.296999999999997]
[null,400,null,340.63738789917699,100.413893736549,69.586343430405805,2.6156721597284101,null,57.968143463134766,72.486930847167969,76.004669189453125,79.522407531738281,83.268745422363281,87.015083312988281,77.040657043457031,83.026237487792969,89.011817932128906,97.843254089355469,76.526161189999996,90.599090579999995,80.684738159999995,97.01605988,110.4172592,81.749267578125,89.774436950683594,97.799606323242188,111.56788635253906,124.124588,113.59973909999999,120.34703829999999,107.30943298339844,125.43875885009766,143.56808471679688,107.6462021,126.0126114,143.64926149999999,128.38230899999999,88.390975952148438,98.896766662597656,109.40255737304688,129.14910888671875,148.89566040039063,90.320373540000006,110.6723709,131.2376404,111.696434,94.002708435058594,103.30239868164063,112.60208892822266,134.06900024414063,125.43875885009766,null,291.32188575573701,31.497666747968001,25.9697502459593,172.655169626521,61.788316634764101,86.332363962511593,181.83210770808799,null,null,null,null,{"$f":"J38+(O38-J38)*0.75","v":75.902225494384766},{"$f":"L38+(Q38-L38)*0.75","v":86.63946533203125},{"$f":"N38+(R38-N38)*0.75","v":95.136211395263672},{"$f":"E38/2","v":50.2069468682745},60.368582933785703,57.877825783092398,60.761685330144303,77.033313603065395,201,null,146.4,201,93.2,99.2,47.5,38.5,62.9,58.34,60.77,32.46,77.099999999999994,55.4,49.012999999999998,39.496000000000002,68.61,68.400000000000006,80.733333333333334,82.85,83.625,76.650000000000006,71.5,85.399999999999991,80.400000000000006,null,51.462000000000003,52.457999999999998,45.1,62.2,51.3,61.4,51.3,60.328000000000003,44.713000000000001,39,null,null,null,92.8,92.8,43.45,91.1,92.8,92.8,92.8,91.1,67.275000000000006,91.1,87.6,90.7,83.284999999999997,30.11,85.049000000000007,33.368000000000002,85.049000000000007,33.368000000000002]
[null,600,null,196.190839656798,29.7820632218273,32.6526993770619,2.7396158201048801,null,40.803493499755859,47.443019866943359,54.362945556640625,61.282871246337891,69.221519470214844,77.160167694091797,46.682903289794922,53.897148132324219,61.111392974853516,73.6800537109375,46.16686249,61.060962680000003,45.519592289999999,60.779644009999998,74.433891299999999,45.841915130615234,53.290393829345703,60.738872528076172,74.46148681640625,86.37200928,74.512046810000001,74.649848939999998,59.895488739013672,74.524627685546875,89.153766632080078,59.830596919999998,74.505126950000005,88.372550959999998,74.427795410000002,43.872829437255859,51.675621032714844,59.478412628173828,74.383918762207031,89.289424896240234,45.6049881,59.263080600000002,74.238975519999997,59.071414949999998,46.067329406738281,52.477573394775391,58.8878173828125,73.95928955078125,74.524627685546875,null,153.45051710827201,19.369012372385701,13.9064433692755,123.84435432602901,24.8881100663646,29.374958118724098,96.769396807044501,null,null,null,null,46.872932434082031,61.154262542724609,74.550082206726074,14.89103161091365,44.4147791167062,42.887708289664801,39.8610018392596,66.975070609529894,126,null,55.9,126,64.22,67.739999999999995,52,42.6,46.1,53.38,56.17,27.76,47.2,31.5,45.16,36.542999999999999,67.92,68.040000000000006,80.833333333333329,81.75,82.65,76.599999999999994,70.650000000000006,78.766666666666666,75.7,null,45.191000000000003,40.24,39.1,57.1,44.7,56.7,44.7,56.305999999999997,40.015999999999998,24,null,null,null,61.7,61.7,25.4,61.15,61.7,61.7,61.7,61.15,43.275000000000006,61.15,56.8,60.7,39.249000000000002,21.501999999999999,38.633000000000003,25.108000000000001,38.633000000000003,25.108000000000001]
[null,800,null,126.441248768091,16.8639446063553,14.169370743536099,1.2942100454958401,null,17.636526107788086,42.953487396240234,42.170505523681641,41.387523651123047,37.53070068359375,33.673877716064453,49.9364013671875,50.673267364501953,51.410133361816406,50.394397735595703,49.087749479999999,53.801593779999997,52.78537369,61.139911650000002,65.388145449999996,54.738155364990234,58.39776611328125,62.057376861572266,66.784927368164063,71.225532529999995,69.288940429999997,77.226722719999998,72.24273681640625,83.724525451660156,95.206314086914063,72.631874080000003,84.460342409999996,96.495315550000001,87.416267399999995,59.455535888671875,67.062141418457031,74.668746948242188,88.339073181152344,102.0093994140625,59.098522189999997,74.934349060000002,89.460739140000001,74.935859679999993,59.431968688964844,67.18670654296875,74.941444396972656,89.787361145019531,83.724525451660156,null,159.49636019108701,7.9521843059282,6.2108280947494201,40.825501725794098,22.4009400296341,33.048317159883702,74.815022947435594,null,null,null,null,48.190672874450684,48.904480934143066,46.214267730712891,8.4319723031776501,28.611700933622998,24.565133409829301,21.995171047537401,31.5123877682997,94,null,23.6,94,39.57,40.86,29,23.6,26.6,29.47,30.84,14.84,25.2,16.100000000000001,28.268999999999998,22.725000000000001,40.46,42.92,48.300000000000004,48.3,48.85,46.25,43.2,50.833333333333336,48.3,null,23.466999999999999,20.068999999999999,21.8,32.5,23.9,32.299999999999997,23.9,32.288249999999998,22.489000000000001,14,null,null,null,32.6,32.6,12.25,33.1,32.6,32.6,32.6,33.1,22.675000000000001,33.1,36.5,33.6,21.132999999999999,12.37,20.632999999999999,13.877000000000001,20.795000000000002,13.877000000000001]
[null,1000,null,121.463503235305,7.3134984195184396,6.4046162277662804,0.82590429872071602,null,11.349647521972656,28.898900985717773,25.819370269775391,22.739839553833008,19.427656173706055,16.115472793579102,34.340187072753906,33.382789611816406,32.425392150878906,28.651405334472656,32.978008269999997,34.023609159999999,35.977233890000001,40.472557070000001,42.082546229999998,37.107616424560547,39.124225616455078,41.140834808349609,43.100383758544922,43.289710999999997,44.97490311,50.951450350000002,48.854045867919922,55.982921600341797,63.111797332763672,49.159034730000002,56.532459260000003,64.098518369999994,58.741596219999998,41.648506164550781,46.210681915283203,50.772857666015625,59.435726165771484,68.098594665527344,41.516704560000001,51.971889500000003,61.52905655,52.929054260000001,42.712608337402344,48.230426788330078,53.748245239257813,64.680870056152344,55.982921600341797,null,138.44280005383601,4.1165200220484301,2.2590960523709098,29.431677470564001,11.820250529334601,14.470244442686701,30.415298687681801,null,null,null,null,32.979865550994873,30.004004001617432,25.517422199249268,3.6567492097592198,18.709097325043,15.120045963194,13.168589025654001,17.3001310783687,93,null,10.9,93,22.97,24.69,16.7,14.3,17.2,18.3,19.45,8.4600000000000009,14.5,8.9,19.39,15.728,26.42,29.14,31.566666666666663,31.200000000000003,31.6,31.15,29.5,34.933333333333337,33.5,null,13.122,11.885,12.3,20.2,15,20.100000000000001,15,20.132000000000001,12.619,8.5,null,null,null,18.8,18.8,6.65,19.25,18.8,18.8,18.8,19.25,12.95,19.25,21.9,19.600000000000001,15.19,8.1389999999999993,14.51,9.0259999999999998,14.51,9.0259999999999998]
[null,1200,null,108.53373930862099,3.2446364725708299,5.7424923482326298,0.65425944839878103,null,7.5299715995788574,16.706501960754395,15.77397632598877,14.841450691223145,12.629712104797363,10.417973518371582,22.643789291381836,21.305364608764648,19.966939926147461,18.372640609741211,22.75479507,21.232044219999999,25.67230034,27.65056229,26.24343872,26.718761444091797,27.5137939453125,28.308826446533203,27.23261833190918,27.890981669999999,29.243625640000001,35.078121189999997,35.325389862060547,39.433082580566406,43.540775299072266,35.58948135,39.90536118,44.481098179999996,41.792354580000001,30.28167724609375,33.596199035644531,36.910720825195313,42.376224517822266,47.841728210449219,30.284765239999999,37.770481109999999,44.036891939999997,38.437412260000002,31.080207824707031,35.046833038330078,{"$f":"AW10","v":39.013458251953125},{"$f":"AX10","v":46.383937835693359},{"$f":"AY10","v":39.433082580566406},null,107.503921179123,2.6189912173303198,0.835866960778757,22.976411479979902,8.9193027903984206,9.7300923506305192,21.468294215935099,null,null,null,null,21.159467458724976,18.685567617416382,16.383973836898804,1.6223182362854149,12.8171247825418,10.1457693990263,9.0187074644348399,11.7359775542169,93,null,1.9,93,13.1,14.07,10.4,9,12.7,11.88,12.52,6.21,8.9,5.7,11.166,9.02,17.28,19.68,20.8,20.45,20.75,20.65,19.8,24.566666666666663,23.9,null,9.1280000000000001,8.2309999999999999,8.4,13,9.6,12.9,9.6,12.988999999999999,8.625,7,null,null,null,11.4,11.4,4.4000000000000004,11.65,11.4,11.4,11.4,11.65,8.0250000000000004,11.65,13.4,11.9,10.874000000000001,5.7869999999999999,10.794,6.4850000000000003,10.794,6.4850000000000003]
[null,1400,null,84.642368098667603,0.967201620226814,3.7204608881447898,0.67466670024004605,null,{"$f":"I11","v":5.5265650749206543},12.032747268676758,11.353723526000977,10.674699783325195,8.9997415542602539,7.3247833251953125,15.181987762451172,14.639549255371094,14.097110748291016,12.786395072937012,15.596255299999999,14.869821549999999,18.69837952,18.811019900000002,17.987314219999998,19.700767517089844,19.529823303222656,19.358879089355469,18.619943618774414,18.876094819999999,19.81679153,24.274019240000001,26.709671020507813,28.577728271484375,30.445785522460938,26.98623276,29.069664,31.592924119999999,31.0768795,23.934793472290039,26.179908752441406,28.425024032592773,31.716272354125977,35.00752067565918,23.963920590000001,29.471920010000002,33.646888730000001,30.08890152,24.908489227294922,27.738361358642578,30.568233489990234,35.751201629638672,28.577728271484375,null,64.667710465930696,1.33598865015835,0.54586688436040498,15.189998516957999,7.6254221062050096,6.7230812741484698,13.412661210906,null,null,null,null,14.394677639007568,13.241508007049561,11.420992136001587,0.483600810113407,9.5483368501401795,7.5859515074349897,6.8604186159640097,8.5318194765852997,73,null,1.2,73,8.7100000000000009,9.48,6.3,5.8,10.199999999999999,8.85,9.2899999999999991,4.76,6.3,4.0999999999999996,5.49,4.9930000000000003,12.48,14.2,15.166666666666666,14.850000000000001,15.075000000000001,14.850000000000001,14.149999999999999,16.866666666666664,15.4,null,6.6079999999999997,5.907,6.3,9.6,7.1,9.5,7.1,9.5579999999999998,6.4909999999999997,5.5,null,null,null,8,8,3.1,8.15,8,8,8,8.15,5.625,8.15,9.3000000000000007,8.3000000000000007,8.5120000000000005,4.4119999999999999,8.4139999999999997,4.8579999999999997,8.4139999999999997,4.8579999999999997]
[null,1800,null,55.673774213081003,2.75275567394154,0,0.45134885578503497,null,3.2715094089508057,7.3904132843017578,6.8269343376159668,6.2634553909301758,5.1761984825134277,4.0889415740966797,8.9743213653564453,8.604365348815918,8.2344093322753906,7.2339911460876465,9.0113687519999992,8.6336097719999998,10.50348949,10.51054287,9.9895458220000002,10.929755210876465,10.845381736755371,10.761008262634277,10.301322937011719,10.517024989999999,10.883280750000001,12.914929389999999,14.61003589630127,14.888544082641602,15.167052268981934,14.80760956,15.13154125,16.540407179999999,16.176721570000002,15.133969306945801,15.528033256530762,15.922097206115723,16.527185440063477,17.13227367401123,15.43140316,16.910158160000002,17.62989426,17.73889732,16.840934753417969,17.676689147949219,18.512443542480469,19.585325241088867,14.888544082641602,null,36.888017738778402,1.28205765333237,0.89078253447966804,7.1157116099201501,6.3149805126912701,4.6502466075670901,8.0633463194917301,null,null,null,null,8.5783443450927734,7.7416708469390869,6.4477287530899048,1.37637783697077,6.4889491542106601,5.2275300279036498,4.8781218855097004,4.9345509881475396,45,null,1.4,45,4.7699999999999996,5.61,4.5,3.7,8,5.38,5.62,2.11,4,2.6,2.2149999999999999,1.986,7.3,8.42,9.1333333333333346,8.8500000000000014,9,8.6999999999999993,8.3000000000000007,9.5333333333333332,9.3000000000000007,null,3.8,3.351,3.8,5.8,4.4000000000000004,5.8,4.4000000000000004,5.8439999999999994,3.9529999999999998,5,null,null,null,4.7,4.7,1.85,4.75,4.7,4.7,4.7,4.75,3.3000000000000003,4.75,5.3,4.8,4.2329999999999997,2.6509999999999998,4.0579999999999998,2.9510000000000001,4.0579999999999998,2.9510000000000001]
[null,2200,null,21.362919205710998,2.07999280883273,0.84716935938302695,0.44770198248919502,null,1.3216179609298706,4.8363490104675293,4.4509921073913574,4.0656352043151855,2.5302050113677979,0.99477481842041016,5.7750911712646484,5.4859905242919922,5.1968898773193359,4.4857454299926758,5.7897057529999998,5.4278502460000002,6.5749273300000004,6.5056977270000003,6.0411195759999998,6.8585963249206543,6.7526907920837402,6.6467852592468262,6.2171306610107422,6.3811612130000004,6.5425100330000001,7.6657576560000003,8.6602602005004883,8.6876325607299805,8.7150049209594727,8.7633085249999993,8.8064708710000001,9.8019943240000007,9.3120708469999993,8.9171600341796875,9.1302871704101563,9.343414306640625,9.4884853363037109,9.6335563659667969,9.0572147370000007,9.802516937,10.058365820000001,10.191379550000001,9.7759122848510742,10.164765357971191,10.553618431091309,11.028091430664063,8.6876325607299805,null,26.569043347948998,1.2413666026774599,1.0075380588276499,5.2613617523471401,2.5548272642431402,3.29876316965606,5.5425721646377699,null,null,null,null,5.5404056310653687,4.9140762090682983,3.6130027770996094,1.039996404416365,5.1359898392523302,4.2357990983486298,4.0300390714121104,2.1879706630604399,30,null,2.2000000000000002,30,2.9,3.64,2.2999999999999998,1.5,7,3.32,3.56,1.27,2.7,1.7,1.143,1.008,4.68,5.42,6.0333333333333341,5.75,5.8999999999999995,5.6,5.25,5.833333333333333,5.7,null,1.9830000000000001,1.698,2,3.9,2.6,3.9,2.6,3.9477500000000001,2.036,2.5,null,null,null,3.2,3.2,1.2,3.2,3.2,3.2,3.2,3.2,2.2000000000000002,3.2,3.4,3.2,2.5990000000000002,1.722,2.4620000000000002,1.91,2.4620000000000002,1.91]
[null,2600,null,25.1865835121699,1.2732424291527,1.9420725591613801,0.431556615885405,null,0.81321293115615845,2.8340897560119629,2.5240485668182373,2.2140073776245117,1.4638104438781738,0.71361351013183594,3.635664701461792,3.3300714492797852,3.0244781970977783,2.40875244140625,3.9518492219999999,3.207206964,4.3435406680000002,4.2814054490000002,3.5784909730000001,4.5275402069091797,4.4447588920593262,4.3619775772094727,3.722553014755249,3.742574453,4.0015044209999999,4.7841138839999999,5.3469357490539551,5.3262062072753906,5.3054766654968262,5.3964333529999999,5.3861026760000001,6.0109968189999998,5.6295852660000003,5.5156149864196777,5.5944070816040039,5.6731991767883301,5.7068986892700195,5.740598201751709,5.5518198009999997,5.8888211249999998,5.9452919959999999,6.0751690859999998,5.9476666450500488,6.0988092422485352,6.2499518394470215,6.3684892654418945,5.3262062072753906,null,17.204298312323399,1.3494249989596101,1.2344760134699,3.6061245479951798,2.9386903943122502,2.05700660586953,3.9691129821466502,null,null,null,null,3.4352709650993347,2.8218604922294617,1.9849677085876465,0.63662121457635001,4.34329738237233,3.6731815660512899,3.4042600515694299,1.2136024781613901,21,null,1.9,21,1.66,2.2000000000000002,1.2,0.5,6.4,2.1800000000000002,2.33,0.98,1.9,1.2,0.58099999999999996,0.51300000000000001,3.36,4.0999999999999996,4.333333333333333,4.0999999999999996,4.1999999999999993,4.0999999999999996,3.9,4.4666666666666668,4.4000000000000004,null,1.19,0.88100000000000001,1.3,2.5,1.7,2.5,1.7,2.5202499999999999,1.329,2,null,null,null,2.2999999999999998,2.2999999999999998,0.9,2.2999999999999998,2.2999999999999998,2.2999999999999998,2.2999999999999998,2.2999999999999998,1.6,2.2999999999999998,2.5,2.2999999999999998,1.403,1.0569999999999999,1.3069999999999999,1.095,1.3069999999999999,1.095]
[null,3000,null,18.862787855239102,1.0222491925316199,1.0026596689667999,0.41293189464834201,null,0.84292477369308472,2.1367696523666382,1.7877095937728882,1.4386495351791382,0.98147612810134888,0.52430272102355957,2.5629487037658691,2.325244665145874,2.0875406265258789,1.4971621036529541,2.622822523,2.2036323549999999,3.1507306100000001,2.8062326909999999,2.3409883979999999,3.3011822700500488,3.096508264541626,2.8918342590332031,2.4320898056030273,2.408221245,2.6051151749999999,3.2499396800000002,4.1204814910888672,3.9079458713531494,3.6954102516174316,4.1464862819999997,3.9890875819999998,4.2599129680000001,4.3343591689999998,3.7778992652893066,4.0310769081115723,4.2842545509338379,4.4419770240783691,4.5996994972229004,3.9286255840000002,4.274368763,4.7118024829999996,4.3875284189999997,4.209172248840332,4.3570890426635742,4.5050058364868164,4.9209012985229492,3.9079458713531494,null,11.5209744987033,1.44342182515944,1.36659396376415,2.92123052816547,1.12695738824458,1.48585411980801,3.50932775130009,null,null,null,null,2.4564039409160614,1.9253178536891937,1.2539472579956055,0.51112459626580997,3.8102585119852401,3.1476182891334701,3.0236091544406798,0.92772924084450703,15.7,null,1.3,15.7,1.1200000000000001,1.56,0.5,0.2,6,1.54,1.65,0.76,1.5,0.9,0.40200000000000002,0.29399999999999998,2.4500000000000002,3.02,3.2333333333333329,3,3.0999999999999996,3,2.9,3.2000000000000006,3.2,null,0.83599999999999997,0.73499999999999999,1,1.8,1.2,1.7,1.2,1.8057500000000002,1.0620000000000001,2,null,null,null,1.8,1.8,0.7,1.8,1.8,1.8,1.8,1.8,1.25,1.8,1.9,1.8,1.036,0.86499999999999999,0.94199999999999995,0.77800000000000002,0.94199999999999995,0.77800000000000002]
[null,4000,null,9.1920644294647893,0,0,0,null,0.56292444467544556,0.90104067325592041,0.84076237678527832,0.78048408031463623,0.71877425909042358,0.65706443786621094,1.0492105484008789,0.99771040678024292,0.94621026515960693,0.88070529699325562,1.2128723859999999,0.98030102299999999,1.433474422,1.242422342,1.094655991,1.5413063764572144,1.3949637413024902,1.2486211061477661,1.1284986734390259,1.229005218,1.2123656270000001,1.4845674040000001,1.6865676641464233,1.6338239908218384,1.5810803174972534,1.701498747,1.6563129430000001,1.792022228,1.7777059079999999,2.9210208654403687,2.3571271896362305,1.7932335138320923,1.8279778957366943,1.8627222776412964,2.6120092869999998,1.925233245,1.9845162629999999,2.6429631709999999,2.93096923828125,2.8424975872039795,{"$f":"AW16","v":2.754025936126709},{"$f":"AX16","v":2.1007661819458008},{"$f":"AY16","v":1.6338239908218384},null,2.4075269477707999,1.53555433225256,2.0598653284799502,2.5939413119078201,1.11006892127936,0.87120565412042805,2.3560576663859099,null,null,null,null,1.0121680796146393,0.90477871894836426,0.82479508221149445,0,3.2440625951149902,2.7861909491315799,2.8179511084575202,0.60805078309705496,8.3000000000000007,null,1.5,8.3000000000000007,1.22,1.24,0.3,0.2,5.9,0.99,1.03,0.53,0.9,0.6,0.26500000000000001,0.186,1.52,1.74,1.8666666666666665,1.8,1.8250000000000002,1.75,1.7,2.0666666666666664,1.9,null,0.76100000000000001,0.752,0.6,1,0.8,1,0.8,1.05725,0.65900000000000003,2.5,null,null,null,1.1000000000000001,1.1000000000000001,0.5,1.1000000000000001,1.1000000000000001,1.1000000000000001,1.1000000000000001,1.1000000000000001,0.8,1.1000000000000001,1.2,1.1000000000000001,0.64800000000000002,0.46899999999999997,0.59499999999999997,0.41199999999999998,0.59499999999999997,0.41199999999999998]
[null,6000,null,3.6149166419392502,0,0,0,null,{"$f":"I17","v":0.20043011009693146},0.5218656063079834,0.483406662940979,0.44494771957397461,0.33344349265098572,0.22193926572799683,0.646537184715271,0.60697412490844727,0.56741106510162354,0.47966158390045166,0.637697756,0.590169787,0.71763354499999998,0.70329034300000004,0.63426178700000002,0.73898118734359741,0.7234189510345459,0.70785671472549438,0.64098209142684937,0.72094905399999998,0.67035692899999999,0.72732955200000005,0.84890633821487427,0.79477024078369141,0.74063414335250854,0.85746735299999999,0.78903740600000005,0.90817820999999999,0.81791514200000004,0.97691410779953003,0.9388464093208313,0.90077871084213257,0.83245199918746948,0.7641252875328064,1.1269708869999999,0.93592911999999995,0.84295272799999998,0.97724854900000002,1.2450250387191772,1.116568922996521,0.98811280727386475,0.88732063770294189,0.79477024078369141,null,0,0.85735428039306705,2.9628157102695201,1.52714684905965,0.81025406978145598,0.57626971204081401,1.1849016244280199,null,null,null,null,0.6153692901134491,0.5367952287197113,0.41523100435733795,0,2.7143613902630901,2.6768316935998602,2.7594653365307602,0.46039962334239098,3.4,null,2.1,3.4,1.41,1.45,0.3,0.4,5.7,0.85,0.86,0.51,0.6,0.4,0.219,0.161,0.88,1.06,1.1666666666666667,1.1000000000000001,1.1500000000000001,1.3,1,1.2333333333333334,1.1000000000000001,null,0.80900000000000005,0.80200000000000005,0.5,0.8,0.7,0.8,0.7,0.77650000000000008,0.51400000000000001,2.5,null,null,null,0.7,0.7,0.4,0.7,0.7,0.7,0.7,0.7,0.54999999999999993,0.7,0.7,0.7,0.40200000000000002,0.192,0.59499999999999997,0.41199999999999998,0.59499999999999997,0.41199999999999998]
[null,8000,null,1.6708259249017301,0,0,0,null,0,0.36383810639381409,0.29974275827407837,0.23564741015434265,0.10404429584741592,-2.7558818459510803E-2,0.45129916071891785,0.39545226097106934,0.33960536122322083,0.19826593995094299,0.44937631500000003,0.36176258300000003,0.484042525,0.42496791499999997,0.28203746699999999,0.51055806875228882,0.47419992089271545,0.43784177303314209,0.28589910268783569,0.32323950499999998,0.28696057200000002,0.279565811,0.45395362377166748,0.26786071062088013,8.1767797470092773E-2,0.45357734,0.27089595799999999,0.317575157,0.26630821799999999,0.56381329894065857,0.50426667928695679,0.444720059633255,0.24686558544635773,4.9011111259460449E-2,0.52530986099999999,0.42897352599999999,0.23602414099999999,0.41551464799999999,0.52917751669883728,0.46943268179893494,0.40968784689903259,0.18418365716934204,0.26786071062088013,null,0,0.52495233969146404,1.1106254469930801,0.88347440340247896,1.8306423490711401,0.42801525042771099,1.7279723667092901,null,null,null,null,0.42943389713764191,0.31361587345600128,0.14180975034832954,0,null,null,null,null,0,null,0.6,0,1.53,1.6,0.2,0.5,0,0.84,0.85,0.49,0.5,0.3,0.26400000000000001,0.19400000000000001,0.94,0.96,1.0999999999999999,1.2,1.2,1.4,1,1.2333333333333334,1,null,0.82,0.82099999999999995,0.5,0.8,0.7,0.8,0.7,0.75575000000000003,0.49,1.5,null,null,null,0.6,0.6,0.4,0.55000000000000004,0.6,0.6,0.6,0.55000000000000004,0.47499999999999998,0.55000000000000004,0.5,0.5,0.36199999999999999,0.252,0.59499999999999997,0.41199999999999998,0.59499999999999997,0.41199999999999998]
[null,10000,null,0.74303849211760897,0,0,0,null,0,0.24521391093730927,0.16761714220046997,9.0020373463630676E-2,0,-9.0020373463630676E-2,0.30314162373542786,0.24380795657634735,0.18447428941726685,2.3237179964780807E-2,0.31710943600000002,0.18766933699999999,0.33458307399999998,0.21839156700000001,3.7045315000000002E-2,0.36176089942455292,0.29086434841156006,0.2199677973985672,3.3281769603490829E-2,6.3352308999999996E-2,2.6313011000000001E-2,0,0.13212496042251587,0,-0.13212496042251587,0.13664548100000001,0,0,0,0.31043688952922821,0.20305660367012024,9.5676317811012268E-2,0,-9.5676317811012268E-2,0.24086099899999999,4.4387124E-2,0,0,0.23147660493850708,0.11573830246925354,0,0,0,null,0,0.34817584262650902,0.449303298634746,0.60933611519086095,2.87216176205499,0.25991148805728997,0.879550098137313,null,null,null,null,0.28865969553589821,0.1608608104288578,-5.0772083923220634E-3,0,null,null,null,null,0,null,0.5,0,1.62,1.7,0.3,0.4,0,0.82,0.83,0.47,0.4,0.3,0.316,0.22,0.97,0.98,1.0666666666666667,1.2,1.2249999999999999,1.5,1.05,1.3333333333333333,1.1000000000000001,null,0.83,0.83,0.5,0.7,0.7,0.7,0.7,0.74199999999999999,0.47799999999999998,1.5,null,null,null,0.5,0.5,0.35,0.5,0.5,0.5,0.5,0.5,0.42500000000000004,0.5,0.4,0.5,0.35799999999999998,0.13300000000000001,0.59499999999999997,0.41199999999999998,0.59499999999999997,0.41199999999999998]
[]
["Wheelset 4",200,null,246.354859618261,641.06171757633103,596.25240688469103,318.33530923735901,null,{"$f":"I21","v":0},0,0,0,0,0,0,0,0,0,0,0,0,0,0,0,0,0,0,0,0,0,0,0,0,0,0,0,0,0,0,0,0,0,0,0,0,0,0,0,0,0,0,null,null,78.158129613403105,38.7975298714601,135.283054276325,62.702960448939997,64.621999580929099,140.287382871955,null,null,null,null,{"$f":"J53+(O53-J53)*0.75","v":0},{"$f":"L53+(Q53-L53)*0.75","v":0},{"$f":"N53+(R53-N53)*0.75","v":0},null,null,null,null,null,null,null,395,195,0,0,42.6,30.6,0,0,0,0,53.5,45.4,77.275999999999996,69.897999999999996,89.22,79.7,94.833333333333329,100.6,100.6,100.75,93.65,109.26666666666667,97.3,null,130.185,117.396,0,0,0,0,0,0,0,0,null,null,null,62.9,62.9,84.8,62.75,62.9,62.9,62.9,62.75,52.575000000000003,62.75,69.099999999999994,63.7,40.003999999999998,24.506,39.095999999999997,27.327000000000002,39.095999999999997,27.327000000000002]
[null,400,null,49.837700006675298,334.660821048402,280.01486900710398,19.8005081060215,null,0,0,0,0,0,0,0,0,0,0,0,0,0,0,0,0,0,0,0,0,0,0,0,0,0,0,0,0,0,0,0,0,0,0,0,0,0,0,0,0,0,0,0,null,null,18.049684009945899,15.6060060469911,17.782605695642399,6.5818283445043102,6.1839420930859097,17.0840720777462,null,null,null,null,{"$f":"J54+(O54-J54)*0.75","v":0},{"$f":"L54+(Q54-L54)*0.75","v":0},{"$f":"N54+(R54-N54)*0.75","v":0},null,4.1675434278381296,4.1149103043105102,4.38281883357224,3.3165879753963199,26,null,244.5,26,7.72,8.16,0.5,0.5,10.6,2.5499999999999998,2.67,1.87,17.100000000000001,13.1,1.115,0.64400000000000002,3.07,3.54,3.3666666666666667,3.7,3.7749999999999999,3.4,3.3499999999999996,4.2666666666666666,4,null,47.79,45.905999999999999,2.4,2.9,2.2999999999999998,2.9,2.2999999999999998,2.8352499999999998,2.4950000000000001,0,null,null,null,15.2,15.2,19,14.75,15.2,15.2,15.2,14.75,12.125,14.75,12.8,14.5,5.9589999999999996,1.077,7.3609999999999998,1.0089999999999999,7.3609999999999998,1.0089999999999999]
[null,600,null,1.4921275592936001,204.056475890999,145.97657360241701,1.60118891598678,null,0.33291953802108765,0.60750222206115723,0.7853735089302063,0.96324479579925537,0.98521316051483154,1.0071815252304077,0.34633862972259521,0.42513471841812134,0.50393080711364746,0.59366810321807861,0.30171170800000002,0.42540296900000002,0.19899956899999999,0.23595164699999999,0.229468599,0.19227734208106995,0.20871219038963318,0.22514703869819641,0.21451519429683685,0.12762378199999999,0.18753747600000001,0.11567632899999999,0.10336911678314209,8.1367261707782745E-2,5.9365406632423401E-2,0.10157949500000001,0,0,0,0.19137616455554962,9.5688082277774811E-2,0,0,0,0,0,0,0,0,0,0,0,8.1367261707782745E-2,null,null,7.6890255525566804,7.3508839227879301,6.1017770618985399,1.3680163540252199,0.83160372202464194,6.3955406027171797,null,null,null,null,0.41162952780723572,0.61875930428504944,0.69704645872116089,null,1.35068427657085,1.31036087663293,1.5431957290226801,1.6585017076544,4.4000000000000004,null,158.5,4.4000000000000004,0.19,0.05,5.2,5,9.9,1.71,1.78,1.1299999999999999,15.7,10.199999999999999,1.75,2.1389999999999998,2.92,3.14,3.2666666666666671,2.95,2.875,4,4.1500000000000004,5.2,5.0999999999999996,null,42.901000000000003,38.805999999999997,1.3,1.7,1.4,1.7,1.4,1.7277500000000001,1.4179999999999999,0,null,null,null,12.5,12.5,8.8000000000000007,12,12.5,12.5,12.5,12,8.1999999999999993,12,9.5,11.7,1.7669999999999999,1.464,2.56,1.0740000000000001,2.56,1.0740000000000001]
[null,800,null,0,127.12088909107899,103.978750418107,0.605832753642912,null,5.9381589293479919E-2,3.3403582572937012,2.8694117069244385,2.3984651565551758,1.5081223249435425,0.61777949333190918,7.9523630142211914,5.5072317123413086,3.0621004104614258,2.1545853614807129,5.8111510280000003,5.3278107639999996,6.2769470209999998,5.9033865929999996,4.9931836130000002,6.4487204551696777,6.209169864654541,5.9696192741394043,5.0775852203369141,3.9012010099999999,5.2303357119999996,5.7264199260000002,6.7656478881835938,6.1161842346191406,5.4667205810546875,6.7986693379999998,6.1607108119999996,4.8995671270000001,6.3429951669999998,7.3112373352050781,7.1436481475830078,6.9760589599609375,6.4026026725769043,5.8291463851928711,7.1954956049999996,7.0054569239999998,6.4477515219999999,7.0088376999999999,7.4580659866333008,7.2363066673278809,7.0145473480224609,6.4027042388916016,6.1161842346191406,null,null,2.6318920935644101,3.2563202529147999,1.90486733745092,2.5051216040162498,1.05498383296239,1.26321379346087,null,null,null,null,6.7993618249893188,2.8961915969848633,1.770383894443512,null,1.8293350024533299,1.6597285935450501,1.7092648511923101,0.65180155453775701,0.5,null,105.4,0.5,0.43,0.46,3.1,2.9,8.8000000000000007,1.48,1.55,0.54,8.8000000000000007,5.9,2.4689999999999999,2.3879999999999999,3.3,3.94,3.6,3.4,3.3499999999999996,4.5999999999999996,4.9000000000000004,5.3666666666666671,6.3,null,23.21,20.12,1,1.9,1.2,1.9,1.2,1.98125,1.016,0,null,null,null,6.5,6.5,5.7,6.35,6.5,6.5,6.5,6.35,4.5999999999999996,6.35,6.1,6.3,1.4770000000000001,0.86899999999999999,1.95,0.78,1.95,0.78]
[null,1000,null,5.6665942072388802,98.404057859511298,97.564418590312101,0.41232683351453397,null,0.58748894929885864,3.1888309121131897,2.0873868465423584,0.9859427809715271,0.49185425043106079,-2.2342801094055176E-3,7.7752993106842041,5.2282557487487793,2.6812121868133545,1.1874074935913086,5.9889502529999996,2.9722650050000001,6.6868577,5.7201704979999999,4.509825706,7.0302038192749023,6.4335231781005859,5.8368425369262695,4.6260919570922852,2.0981504919999998,4.8347306249999997,5.5230550770000004,7.343353271484375,6.0933794975280762,4.8434057235717773,7.4109191890000004,6.1576628680000001,4.8918414119999998,6.420853138,8.0499372482299805,7.8934931755065918,7.7370491027832031,6.5050926208496094,5.2731361389160156,8.1557855610000001,7.9067635540000003,6.7641725539999999,8.0453119280000003,8.5060081481933594,8.3421764373779297,8.1783447265625,7.1735730171203613,6.0933794975280762,null,null,2.90106846653685,3.6140539076863498,1.3287919494570499,3.8938209152545999,2.3060051908298398,1.66421056961526,null,null,null,null,6.6286822110414505,2.2573948353528976,0.88999705016613007,null,2.0719057016053299,1.71656478642446,1.74336043085961,0.50416296366388302,1.2,null,107.2,1.2,0.2,0.24,2.1,2.4,7.7,1.07,1.18,0.34,6.6,4.3,1.3049999999999999,1.454,2.1,2.68,2.3666666666666667,2.2999999999999998,2.2999999999999998,2.6,2.8,3.5333333333333332,4,null,12.673999999999999,11.519,0.6,1.3,0.8,1.3,0.8,1.333,0.64600000000000002,0,null,null,null,5.3,5.3,4.3,5.0999999999999996,5.3,5.3,5.3,5.0999999999999996,3.625,5.0999999999999996,4.4000000000000004,5,0.94,0.57999999999999996,1.28,0.45400000000000001,1.28,0.45400000000000001]
[null,1200,null,8.1125585860465907,92.1568827822515,64.435023642506494,0.242457314590797,null,0.67155104875564575,1.3084667325019836,1.1325514316558838,0.95663613080978394,0.74326342344284058,0.52989071607589722,2.2351982593536377,1.7850461006164551,1.3348939418792725,0.99214780330657959,2.8343331809999999,1.451184273,4.5418276789999998,2.5942313669999999,1.572204113,4.7005815505981445,3.7648177146911621,2.8290538787841797,1.6381111145019531,1.492012143,1.8482189179999999,3.2233278749999998,5.465975284576416,4.1779532432556152,2.8899312019348145,5.5705909729999998,4.2820086479999997,3.527131319,4.7255706789999996,7.1401686668395996,6.6371383666992188,6.1341080665588379,4.8905420303344727,3.6469759941101074,7.297230721,6.5493326190000003,5.4082527159999998,6.8853783609999999,7.8835458755493164,7.5305676460266113,{"$f":"AW26","v":7.1775894165039063},{"$f":"AX26","v":6.2956466674804688},{"$f":"AY26","v":4.1779532432556152},null,null,2.4856562219064799,4.4313877700821998,0.58683998023211004,2.4831589725377099,2.85860873137822,0.27316549345797603,null,null,null,null,2.0035153776407242,1.2403294891119003,0.876583531498909,null,2.12495509710436,1.8132424359138499,1.87051185150987,1.05967187659746,2.5,null,112.3,2.5,0.22,0.08,1.7,1.5,7.1,0.73,0.78,0.24,5,3,0.81200000000000006,0.63200000000000001,1.66,2.2000000000000002,1.9000000000000001,1.7,1.7,2.2999999999999998,2.2999999999999998,2.7000000000000006,2.7,null,8.6340000000000003,7.9829999999999997,0.5,0.8,0.6,0.8,0.6,0.88049999999999995,0.47,0,null,null,null,4.2,4.2,2.8,4.0999999999999996,4.2,4.2,4.2,4.0999999999999996,2.75,4.0999999999999996,3.8,4.0999999999999996,0.79800000000000004,0.432,1.0489999999999999,0.313,1.0489999999999999,0.313]
[null,1400,null,5.4653307683127199,94.235340903145897,47.880558818301701,0.173682648174629,null,{"$f":"I27","v":0.83488953113555908},1.4757349491119385,1.2545115947723389,1.0332882404327393,0.92847633361816406,0.82366442680358887,1.7180577516555786,1.5772600173950195,1.4364622831344604,0.99371099472045898,1.6186068060000001,1.5113477710000001,2.5388100150000001,1.8312162160000001,1.5902502540000001,2.4548704624176025,2.158076286315918,1.8612821102142334,1.6486430168151855,1.2564356329999999,1.7582454679999999,2.1122512819999999,3.2551968097686768,2.5350232124328613,1.8148496150970459,3.3287558559999999,2.6135368350000001,2.4515464310000001,2.9414551260000001,4.4556708335876465,4.0916123390197754,3.7275538444519043,3.0480468273162842,2.3685398101806641,4.7135453219999999,4.0205545430000003,3.3772270679999998,4.3290658000000004,5.1548442840576172,4.8888130187988281,4.6227817535400391,4.0690159797668457,2.5350232124328613,null,null,3.3350535938789201,3.9989604731812598,0,2.4936251074523001,1.63175841788891,0,null,null,null,null,1.6574770510196686,1.3356687724590302,0.95119935274124146,null,2.18191756981581,1.87070781953554,1.87579150712029,1.3065650713922801,2.7,null,115.8,2.7,0.28000000000000003,0.15,1.9,1.3,6.7,0.67,0.72,0.26,3.6,2.1,0.45600000000000002,0.371,1.41,1.82,1.5666666666666667,1.45,1.4249999999999998,1.95,2.1,2.5,2.6,null,6.2839999999999998,5.6879999999999997,0.4,0.8,0.5,0.8,0.5,0.79275000000000007,0.42299999999999999,0,null,null,null,3,3,2,3,3,3,3,3,2,3,2.9,3,0.79200000000000004,0.41899999999999998,0.97299999999999998,0.29499999999999998,0.97299999999999998,0.29499999999999998]
[null,1800,null,10.362844806658799,79.985343982486597,17.075270328971602,0.63379282931287695,null,1.1355129480361938,1.5446358919143677,1.4012398719787598,1.2578438520431519,1.3877164125442505,1.5175889730453491,2.03592848777771,1.8050248622894287,1.5741212368011475,1.4996916055679321,1.8582464460000001,1.647918105,2.0221619610000001,1.991808534,1.643203974,2.0872712135314941,2.0532894134521484,2.0193076133728027,1.6522374153137207,1.5822840929999999,1.7210692169999999,2.1220173839999998,2.4175052642822266,2.3464875221252441,2.2754697799682617,2.437362432,2.370738029,2.1103868480000001,2.4723772999999998,2.380723237991333,2.4659743309020996,2.5512254238128662,2.5059185028076172,2.4606115818023682,2.3504328729999999,2.6293694969999999,2.6111903189999999,2.6765296460000001,2.4502198696136475,2.5847179889678955,2.7192161083221436,2.8134806156158447,2.3464875221252441,null,null,1.5317966429312899,2.1693649518651701,0.191532738011508,2.4472121118732302,1.00378073620915,0.17260296187970001,null,null,null,null,1.9131053388118744,1.4950518906116486,1.5041659474372864,null,2.1745892900355202,1.92469745320848,1.9779641805752799,1.7865077009003201,2.4,null,88.5,2.4,0.56000000000000005,0.54,1.6,1.4,6.4,0.76,0.79,0.24,2,1.2,0.50800000000000001,0.49199999999999999,1.36,1.64,1.5666666666666667,1.4,1.4,1.8,1.95,2.4,2.5,null,3.585,3.1869999999999998,0.5,0.8,0.6,0.8,0.6,0.82274999999999998,0.51600000000000001,0,null,null,null,1.7,1.7,2,1.65,1.7,1.7,1.7,1.65,1.325,1.65,1.6,1.6,1.083,0.192,1.2509999999999999,5.7000000000000002E-2,1.2509999999999999,5.7000000000000002E-2]
[null,2200,null,11.7536048866453,65.259995601290697,9.4325556731206994,0.63666971762975499,null,0.66573542356491089,1.5237828493118286,1.5469114780426025,1.5700401067733765,0.81245160102844238,5.4863095283508301E-2,2.0296633243560791,1.9162042140960693,1.8027451038360596,1.9006665945053101,2.0823817249999999,1.852508187,2.1821286679999998,2.1508157250000002,2.1456143860000001,2.3241326808929443,2.2617697715759277,2.1994068622589111,2.1730256080627441,2.1454877849999998,2.2237482069999999,2.4029026029999998,2.5173685550689697,2.5725595951080322,2.6277506351470947,2.5287907120000002,2.5909650329999998,2.4632012840000002,2.6454446319999998,2.4744088649749756,2.5332684516906738,2.5921280384063721,2.6451129913330078,2.6980979442596436,2.4616062639999998,2.6413469310000002,2.690817595,2.6805996890000001,2.5773096084594727,2.6469132900238037,2.7165169715881348,2.7861616611480713,2.5725595951080322,null,null,1.7774154271629501,2.4233172953853099,0,0.30467354877451802,0.58874195209139102,0,null,null,null,null,1.9031932055950165,1.7445688545703888,1.4392157196998596,null,2.1600339878600399,1.9355528041155701,2.0603668787220002,1.01759673060386,1.5,null,64.900000000000006,1.5,0.88,0.88,0.9,0.9,6.2,0.37,0.42,0.27,1.8,1.2,0.439,0.371,1.44,1.7,1.6000000000000003,1.55,1.5249999999999999,1.9,1.95,2,2.4,null,1.851,1.633,0.2,0.9,0.1,0.9,0.1,0.93425000000000002,0.22,0,null,null,null,1.7,1.7,1.6,1.4,1.7,1.7,1.7,1.4,1.0999999999999999,1.4,1,1.1000000000000001,0.998,0.09,1.1120000000000001,0.192,1.1120000000000001,0.192]
[null,2600,null,11.7283555394127,53.952078428722501,3.59900387275892,0.60159660999402198,null,0.20084458589553833,0.52061522006988525,0.64557301998138428,0.7705308198928833,0.87967312335968018,0.98881542682647705,0.86070698499679565,0.79845511913299561,0.73620325326919556,0.98870384693145752,2.2429406639999998,0.72776943400000005,2.353134394,2.374683857,0.93565237499999998,2.4888129234313965,2.4489707946777344,2.4091286659240723,0.92950558662414551,1.1378467080000001,1.0295536519999999,2.7692878250000001,2.693223237991333,2.9691150188446045,3.245006799697876,2.6999299529999998,2.991766691,2.9620230200000002,3.0873367790000001,2.5565719604492188,2.6474118232727051,2.7382516860961914,3.1185877323150635,3.4989237785339355,2.5374619960000002,2.7683882710000001,3.2068433760000001,2.7937126160000001,2.6146008968353271,2.7158007621765137,2.8170006275177002,3.2359397411346436,2.9691150188446045,null,null,1.8686711834191001,3.01077876626124,0,0.67457808171791001,0.26376796367340499,0,null,null,null,null,0.77568404376506805,0.74478514492511749,0.9887317419052124,null,2.0864591964482702,1.96783360454885,2.0444422722256701,1.02143038940922,1.1000000000000001,null,49.2,1.1000000000000001,0.98,0.95,0.7,0.1,6,0.27,0.28000000000000003,0.31,1.4,0.9,0.45400000000000001,0.38200000000000001,0.28999999999999998,0.62,0.3666666666666667,0.4,0.4,0.7,0.8,1,1.1000000000000001,null,1.149,0.84299999999999997,0.2,0.2,0.2,0.2,0.2,0.22574999999999998,0.26400000000000001,0,null,null,null,1.3,1.3,1.6,1.3,1.3,1.3,0.3,1.3,1.05,1.3,1.3,1.3,1.256,0.54200000000000004,1.45,0.629,1.45,0.629]
[null,3000,null,9.0327112311408602,39.9630708035968,2.47647113498404,0.60447406623974498,null,0.20616596937179565,0.77539926767349243,0.77766025066375732,0.77992123365402222,0.28880962729454041,-0.20230197906494141,0.65528267621994019,0.78669154644012451,0.91810041666030884,1.0132724046707153,0.80365568399999998,0.91388297100000004,0.89487802999999999,0.89219957599999999,1.1552879810000001,0.86424815654754639,0.87645518779754639,0.88866221904754639,1.1534593105316162,1.2839829920000001,1.148860097,1.120376348,1.1270737648010254,1.0872888565063477,1.0475039482116699,1.177724481,1.083000422,1.29434216,1.0692902799999999,2.4901597499847412,1.9910467863082886,1.4919338226318359,1.0789084434509277,0.66588306427001953,2.0618841649999999,1.9490298029999999,1.200058222,2.0170114039999998,2.1366486549377441,2.1107380390167236,2.0848274230957031,1.597833514213562,1.0872888565063477,null,null,1.8878940273132201,3.1421804228708301,0,4.5643742026506798E-2,0.14716343622151401,0,null,null,null,null,0.68531182408332825,0.88355562090873718,0.70937880873680115,null,2.0201369088118102,1.92937002684866,2.0319907580824901,0.72363605008448595,1,null,37.5,1,1,1.17,0.4,0.4,5.9,0.33,0.33,0.38,1.1000000000000001,0.8,0.47599999999999998,0.39800000000000002,0.32,0.34,0.43333333333333335,0.5,0.5,0.5,0.5,0.8666666666666667,1,null,0.74399999999999999,0.68700000000000006,0.3,0.3,0.2,0.3,0.2,0.28599999999999998,0.38,0,null,null,null,1.1000000000000001,1.1000000000000001,1.2,1.1000000000000001,1.1000000000000001,1.1000000000000001,1.1000000000000001,1.1000000000000001,0.85000000000000009,1.1000000000000001,1,1.1000000000000001,1.0589999999999999,0.90800000000000003,1.29,1.044,1.29,1.044]
[null,4000,null,1.74678896424316,17.601091844694899,0.94140778263608704,0,null,0.17643159627914429,0.39199885725975037,0.35625836253166199,0.32051786780357361,0.39682060480117798,0.47312334179878235,0.10461720824241638,0.26013103127479553,0.41564485430717468,0.57603937387466431,0.52531540399999999,0.395318061,0.92005497199999997,0.45920407800000002,0.53356021600000003,0.97765660285949707,0.74317723512649536,0.50869786739349365,0.53002619743347168,0.61884951600000004,0.522964239,0.67507946500000005,1.1594498157501221,0.99423795938491821,0.82902610301971436,1.1692762370000001,1.0397534369999999,1.106611609,1.170822263,0.74157404899597168,0.98541176319122314,1.2292494773864746,1.1769518852233887,1.1246542930603027,1.5087770220000001,1.1965608599999999,1.2073819640000001,1.011641741,1.9660511016845703,1.6980559825897217,{"$f":"AW32","v":1.430060863494873},{"$f":"AX32","v":1.3126124143600464},{"$f":"AY32","v":0.99423795938491821},null,null,2.0068785123436501,2.8796752860837498,0.52875973523898601,0,0,0,null,null,null,null,0.17646262049674988,0.39186310768127441,0.55031036585569382,null,2.1742957680024602,1.98657588606332,2.0915630145073099,0.84422345022860201,1,null,22.4,1,1.19,1.23,0.3,0.3,5.9,0.43,0.44,0.31,0.8,0.5,0.48299999999999998,0.38200000000000001,0.39,0.38,0.5,0.5,0.5,0.4,0.35,0.9,0.6,null,0.71099999999999997,0.71099999999999997,0.3,0.4,0.3,0.4,0.3,0.38300000000000001,0.35399999999999998,0,null,null,null,0.9,0.9,1,0.9,0.9,0.9,0.9,0.9,0.7,0.9,0.9,0.9,0.75900000000000001,0.63400000000000001,0.95399999999999996,0.73099999999999998,0.95399999999999996,0.73099999999999998]
[null,6000,null,1.21352008425054,8.4970386187235505,0,0,null,{"$f":"I33","v":0.21385881304740906},0.3331153392791748,0.34963428974151611,0.36615324020385742,0.49862241744995117,0.63109159469604492,0.43578994274139404,0.46575656533241272,0.4957231879234314,0.62550193071365356,0.48453044899999997,0.51897245599999997,0.57709503200000001,0.63108980699999995,0.76634752799999994,0.56819498538970947,0.60350322723388672,0.63881146907806396,0.78605085611343384,0.91291010399999994,0.80866068599999996,0.88369232399999997,0.8072088360786438,0.93895214796066284,1.0706954598426819,0.80038809799999999,0.93453460899999996,1.073271155,0.96736735100000004,0.75563329458236694,0.81338179111480713,0.87113028764724731,0.97556215524673462,1.0799940228462219,0.86569923199999999,0.90945923299999998,1.0209161040000001,0.94311726100000004,0.85938316583633423,0.91408884525299072,0.96879452466964722,1.094901442527771,0.93895214796066284,null,null,0.75772648235999995,2.88200016989718,0,8.2395073024088702E-2,0,0,null,null,null,null,0.41012129187583923,0.4633307009935379,0.6268993467092514,null,2.1464886435131101,2.06623162005108,2.16882806813175,1.0220056203899099,0.5,null,10.199999999999999,0.5,1.31,1.36,0.6,0.1,5.7,0.82,0.8,0.42,0.5,0.4,0.40400000000000003,0.31,0.75,0.46,0.6,0.8,0.77500000000000013,1.4,0.8,1.2333333333333334,0.6,null,0.76900000000000002,0.76900000000000002,0.4,0.6,0.7,0.6,0.7,0.62624999999999997,0.40899999999999997,0,null,null,null,0.6,0.6,0.8,0.6,0.6,0.6,0.6,0.6,0.5,0.6,0.5,0.6,0.54400000000000004,0.435,0.95399999999999996,0.73099999999999998,0.95399999999999996,0.73099999999999998]
[null,8000,null,0.57844591445866,4.0612707816419098,0,0,null,0.23110458254814148,0.39162755012512207,0.408407062292099,0.42518657445907593,0.55237400531768799,0.67956143617630005,0.47667610645294189,0.51920396089553833,0.56173181533813477,0.752288818359375,0.51581871499999998,0.59249180599999995,0.62048196799999999,0.71672689899999997,0.91020321800000004,0.60353010892868042,0.66825157403945923,0.73297303915023804,0.92491382360458374,1.092821598,0.95341539399999997,1.0412660840000001,0.86925947666168213,1.1260197162628174,1.3827799558639526,0.87922781699999997,1.141190648,1.3277829889999999,1.194533348,0.74799877405166626,0.83210277557373047,0.91620677709579468,1.2158737182617188,1.5155406594276428,0.81198203599999996,0.933803618,1.288679838,0.96706449999999999,0.8051413893699646,0.89803928136825562,0.99093717336654663,1.3637007474899292,1.1260197162628174,null,null,0.277217369747639,1.23567777765572,0,1.33843266936739,0,0.67080154561246597,null,null,null,null,0.45541396737098694,0.52759550511837006,0.73410697281360626,null,null,null,null,null,0,null,7.2,0,1.42,1.53,0.3,0.1,0,0.94,0.93,0.44,0.4,0.3,0.41799999999999998,0.30599999999999999,1.23,1.1000000000000001,1.0999999999999999,1.3,1.3,2.0499999999999998,1.25,1.7,1.2,null,0.79100000000000004,0.79300000000000004,0.5,0.8,0.8,0.8,0.8,0.78900000000000003,0.46300000000000002,0,null,null,null,0.6,0.6,0.8,0.5,0.6,0.6,0.6,0.5,0.44999999999999996,0.5,0.5,0.5,0.45600000000000002,0.30299999999999999,0.95399999999999996,0.73099999999999998,0.95399999999999996,0.73099999999999998]
[null,10000,null,0.17749448437243701,2.2303214910484499,0,0,null,0.26411652565002441,0.36888182163238525,0.408191978931427,0.44750213623046875,0.57188123464584351,0.69626033306121826,0.48825764656066895,0.56132835149765015,0.63439905643463135,0.85458469390869141,0.549575865,0.67686486199999996,0.65523117799999997,0.80138373399999996,1.0427561999999999,0.65366059541702271,0.73751473426818848,0.82136887311935425,1.0618700981140137,1.2315765620000001,1.0989929439999999,1.24360168,0.99520677328109741,1.3865997791290283,1.7779927849769592,0.99866038599999996,1.402879596,1.64291513,1.470005512,0.74581468105316162,0.91149896383285522,1.0771832466125488,1.4896657466888428,1.9021482467651367,0.83660888700000002,1.1449061629999999,1.5614173410000001,1.184032559,0.79566550254821777,1.001649022102356,1.2076325416564941,1.6964575052261353,1.3865997791290283,null,null,5.6340105091358103E-2,0.50381116610582199,0,2.74404237222917,0,0,null,null,null,null,0.45841369032859802,0.5876748263835907,0.81500360369682312,null,null,null,null,null,0,null,5,0,1.54,1.63,0.2,0.1,0,0.99,0.99,0.46,0.4,0.3,0.47599999999999998,0.32200000000000001,1.42,1.32,1.3666666666666665,1.6,1.6,2.6,1.45,1.8333333333333333,1.3,null,0.79800000000000004,0.80100000000000005,0.5,0.9,0.8,0.9,0.8,0.85525000000000007,0.495,0,null,null,null,0.6,0.5,0.8,0.5,0.5,6,0.6,0.5,0.44999999999999996,0.5,0.4,0.5,0.41799999999999998,0.23599999999999999,0.95399999999999996,0.73099999999999998,0.95399999999999996,0.73099999999999998]
[]
["Wheelset 5",200,null,null,208.43457727428799,253.948088103922,73.264503669448402,null,null,null,null,null,null,null,null,null,null,null,null,null,null,null,null,null,null,null,null,null,null,null,null,null,null,null,null,null,null,null,null,null,null,null,null,null,null,null,null,null,null,null,null,null,null,null,null,null,null,null,null,null,null,null,null,null,null,null,null,null,null,null,null,null,null,81.8]
[null,400,null,null,129.38235264640201,84.819345809096106,9.9434484959469405,null,null,null,null,null,null,null,null,null,null,null,null,null,null,null,null,null,null,null,null,null,null,null,null,null,null,null,null,null,null,null,null,null,null,null,null,null,null,null,null,null,null,null,null,null,null,null,null,null,null,null,null,null,null,null,null,null,null,null,null,null,null,null,null,null,null,86.9]
[null,600,null,null,57.0317695008466,26.157564670695301,5.3439204522003196,null,null,null,null,null,null,null,null,null,null,null,null,null,null,null,null,null,null,null,null,null,null,null,null,null,null,null,null,null,null,null,null,null,null,null,null,null,null,null,null,null,null,null,null,null,null,null,null,null,null,null,null,null,null,null,null,null,null,null,null,null,null,null,null,null,null,75]
[null,800,null,null,39.020275580102002,13.4501468991623,4.0342124945059501,null,null,null,null,null,null,null,null,null,null,null,null,null,null,null,null,null,null,null,null,null,null,null,null,null,null,null,null,null,null,null,null,null,null,null,null,null,null,null,null,null,null,null,null,null,null,null,null,null,null,null,null,null,null,null,null,null,null,null,null,null,null,null,null,null,null,77.2]
[null,1000,null,null,6.8765550960193904,3.4481068455443,2.6663551619263699,null,null,null,null,null,null,null,null,null,null,null,null,null,null,null,null,null,null,null,null,null,null,null,null,null,null,null,null,null,null,null,null,null,null,null,null,null,null,null,null,null,null,null,null,null,null,null,null,null,null,null,null,null,null,null,null,null,null,null,null,null,null,null,null,null,null,67.3]
[null,1200,null,null,0.96517828711336395,0.91595777006469603,1.9111020629792801,null,null,null,null,null,null,null,null,null,null,null,null,null,null,null,null,null,null,null,null,null,null,null,null,null,null,null,null,null,null,null,null,null,null,null,null,null,null,null,null,null,null,null,null,null,null,null,null,null,null,null,null,null,null,null,null,null,null,null,null,null,null,null,null,null,null,54.8]
[null,1400,null,null,0,0.36049111614574902,1.3927609470591,null,null,null,null,null,null,null,null,null,null,null,null,null,null,null,null,null,null,null,null,null,null,null,null,null,null,null,null,null,null,null,null,null,null,null,null,null,null,null,null,null,null,null,null,null,null,null,null,null,null,null,null,null,null,null,null,null,null,null,null,null,null,null,null,null,null,39.799999999999997]
[null,1800,null,null,4.0888132555199199,0.97157607609412699,0.95129408550483996,null,null,null,null,null,null,null,null,null,null,null,null,null,null,null,null,null,null,null,null,null,null,null,null,null,null,null,null,null,null,null,null,null,null,null,null,null,null,null,null,null,null,null,null,null,null,null,null,null,null,null,null,null,null,null,null,null,null,null,null,null,null,null,null,null,null,25.7]
[null,2200,null,null,1.5674303848119,0.16691398292545601,0.72518003574593104,null,null,null,null,null,null,null,null,null,null,null,null,null,null,null,null,null,null,null,null,null,null,null,null,null,null,null,null,null,null,null,null,null,null,null,null,null,null,null,null,null,null,null,null,null,null,null,null,null,null,null,null,null,null,null,null,null,null,null,null,null,null,null,null,null,null,17.100000000000001]
[null,2600,null,null,1.32225625401451,0.13536166996966301,0.57614872539373496,null,null,null,null,null,null,null,null,null,null,null,null,null,null,null,null,null,null,null,null,null,null,null,null,null,null,null,null,null,null,null,null,null,null,null,null,null,null,null,null,null,null,null,null,null,null,null,null,null,null,null,null,null,null,null,null,null,null,null,null,null,null,null,null,null,null,11.4]
[null,3000,null,null,1.2378061989943101,9.0635436745343606E-2,0.50620335918378301,null,null,null,null,null,null,null,null,null,null,null,null,null,null,null,null,null,null,null,null,null,null,null,null,null,null,null,null,null,null,null,null,null,null,null,null,null,null,null,null,null,null,null,null,null,null,null,null,null,null,null,null,null,null,null,null,null,null,null,null,null,null,null,null,null,null,8.6999999999999993]
[null,4000,null,null,0,0,1.20106366185603E-2,null,null,null,null,null,null,null,null,null,null,null,null,null,null,null,null,null,null,null,null,null,null,null,null,null,null,null,null,null,null,null,null,null,null,null,null,null,null,null,null,null,null,null,null,null,null,null,null,null,null,null,null,null,null,null,null,null,null,null,null,null,null,null,null,null,null,4.7]
[null,6000,null,null,0,0,0,null,null,null,null,null,null,null,null,null,null,null,null,null,null,null,null,null,null,null,null,null,null,null,null,null,null,null,null,null,null,null,null,null,null,null,null,null,null,null,null,null,null,null,null,null,null,null,null,null,null,null,null,null,null,null,null,null,null,null,null,null,null,null,null,null,null,3.1]
[null,8000,null,null,0,0,0,null,null,null,null,null,null,null,null,null,null,null,null,null,null,null,null,null,null,null,null,null,null,null,null,null,null,null,null,null,null,null,null,null,null,null,null,null,null,null,null,null,null,null,null,null,null,null,null,null,null,null,null,null,null,null,null,null,null,null,null,null,null,null,null,null,null,1.4]
[null,10000,null,null,0,0,0,null,null,null,null,null,null,null,null,null,null,null,null,null,null,null,null,null,null,null,null,null,null,null,null,null,null,null,null,null,null,null,null,null,null,null,null,null,null,null,null,null,null,null,null,null,null,null,null,null,null,null,null,null,null,null,null,null,null,null,null,null,null,null,null,null,null,0.8]
[]
["Wheelset 6",200,null,null,360.38898273230302,364.42038509188899,165.171590893889,null,null,null,null,null,null,null,null,null,null,null,null,null,null,null,null,null,null,null,null,null,null,null,null,null,null,null,null,null,null,null,null,null,null,null,null,null,null,null,null,null,null,null,null,null,null,null,null,null,null,null,null,null,null,null,null,null,null,null,null,null,null,null,null,null,null,433.7]
[null,400,null,null,94.865540685090394,103.673376684139,12.1979453514447,null,null,null,null,null,null,null,null,null,null,null,null,null,null,null,null,null,null,null,null,null,null,null,null,null,null,null,null,null,null,null,null,null,null,null,null,null,null,null,null,null,null,null,null,null,null,null,null,null,null,null,null,null,null,null,null,null,null,null,null,null,null,null,null,null,null,146.30000000000001]
[null,600,null,null,40.449124248787797,31.110105558743001,2.1986196963126301,null,null,null,null,null,null,null,null,null,null,null,null,null,null,null,null,null,null,null,null,null,null,null,null,null,null,null,null,null,null,null,null,null,null,null,null,null,null,null,null,null,null,null,null,null,null,null,null,null,null,null,null,null,null,null,null,null,null,null,null,null,null,null,null,null,null,60.8]
[null,800,null,null,16.6787563911696,13.4521877465274,1.34276849448644,null,null,null,null,null,null,null,null,null,null,null,null,null,null,null,null,null,null,null,null,null,null,null,null,null,null,null,null,null,null,null,null,null,null,null,null,null,null,null,null,null,null,null,null,null,null,null,null,null,null,null,null,null,null,null,null,null,null,null,null,null,null,null,null,null,null,30.1]
[null,1000,null,null,7.1755248899912498,6.2327042985124601,0.81027375575230998,null,null,null,null,null,null,null,null,null,null,null,null,null,null,null,null,null,null,null,null,null,null,null,null,null,null,null,null,null,null,null,null,null,null,null,null,null,null,null,null,null,null,null,null,null,null,null,null,null,null,null,null,null,null,null,null,null,null,null,null,null,null,null,null,null,null,15]
[null,1200,null,null,3.0765509914468798,5.5096790475279498,0.52561194122135801,null,null,null,null,null,null,null,null,null,null,null,null,null,null,null,null,null,null,null,null,null,null,null,null,null,null,null,null,null,null,null,null,null,null,null,null,null,null,null,null,null,null,null,null,null,null,null,null,null,null,null,null,null,null,null,null,null,null,null,null,null,null,null,null,null,null,4.8]
[null,1400,null,null,0.82386676981335505,3.3656424015568698,0.37311989243666199,null,null,null,null,null,null,null,null,null,null,null,null,null,null,null,null,null,null,null,null,null,null,null,null,null,null,null,null,null,null,null,null,null,null,null,null,null,null,null,null,null,null,null,null,null,null,null,null,null,null,null,null,null,null,null,null,null,null,null,null,null,null,null,null,null,null,2.2000000000000002]
[null,1800,null,null,2.68458430930189,0,0.35056829849753801,null,null,null,null,null,null,null,null,null,null,null,null,null,null,null,null,null,null,null,null,null,null,null,null,null,null,null,null,null,null,null,null,null,null,null,null,null,null,null,null,null,null,null,null,null,null,null,null,null,null,null,null,null,null,null,null,null,null,null,null,null,null,null,null,null,null,1.4]
[null,2200,null,null,2.1532263279746902,1.6102199801553401,0.30924018694038202,null,null,null,null,null,null,null,null,null,null,null,null,null,null,null,null,null,null,null,null,null,null,null,null,null,null,null,null,null,null,null,null,null,null,null,null,null,null,null,null,null,null,null,null,null,null,null,null,null,null,null,null,null,null,null,null,null,null,null,null,null,null,null,null,null,null,1.2]
[null,2600,null,null,1.210256690192,2.8551482466649301,0.25152196112400699,null,null,null,null,null,null,null,null,null,null,null,null,null,null,null,null,null,null,null,null,null,null,null,null,null,null,null,null,null,null,null,null,null,null,null,null,null,null,null,null,null,null,null,null,null,null,null,null,null,null,null,null,null,null,null,null,null,null,null,null,null,null,null,null,null,null,0.6]
[null,3000,null,null,0.85727325282281297,1.4246103167320801,0.23328713440454199,null,null,null,null,null,null,null,null,null,null,null,null,null,null,null,null,null,null,null,null,null,null,null,null,null,null,null,null,null,null,null,null,null,null,null,null,null,null,null,null,null,null,null,null,null,null,null,null,null,null,null,null,null,null,null,null,null,null,null,null,null,null,null,null,null,null,0.9]
[null,4000,null,null,0,0,0,null,null,null,null,null,null,null,null,null,null,null,null,null,null,null,null,null,null,null,null,null,null,null,null,null,null,null,null,null,null,null,null,null,null,null,null,null,null,null,null,null,null,null,null,null,null,null,null,null,null,null,null,null,null,null,null,null,null,null,null,null,null,null,null,null,null,0.9]
[null,6000,null,null,0,0,0,null,null,null,null,null,null,null,null,null,null,null,null,null,null,null,null,null,null,null,null,null,null,null,null,null,null,null,null,null,null,null,null,null,null,null,null,null,null,null,null,null,null,null,null,null,null,null,null,null,null,null,null,null,null,null,null,null,null,null,null,null,null,null,null,null,null,1.6]
[null,8000,null,null,0,0,0,null,null,null,null,null,null,null,null,null,null,null,null,null,null,null,null,null,null,null,null,null,null,null,null,null,null,null,null,null,null,null,null,null,null,null,null,null,null,null,null,null,null,null,null,null,null,null,null,null,null,null,null,null,null,null,null,null,null,null,null,null,null,null,null,null,null,0.7]
[null,10000,null,null,0,0,0,null,null,null,null,null,null,null,null,null,null,null,null,null,null,null,null,null,null,null,null,null,null,null,null,null,null,null,null,null,null,null,null,null,null,null,null,null,null,null,null,null,null,null,null,null,null,null,null,null,null,null,null,null,null,null,null,null,null,null,null,null,null,null,null,null,null,0.6]

{"sheet":"Passenger","index":5,"n_rows":216,"n_cols":15,"rows_kept":216,"cut":false,"hidden":true,"merged":[[1,1,2,1],[1,2,2,2],[1,3,2,3],[1,11,2,11],[1,12,2,12],[1,8,2,8],[1,9,2,9],[1,10,2,10],[1,4,1,7]]}
[]
[null,"Vehicle type","2016/17 vehicle miles where available","Operating weight (t)","Speed (mph)",null,null,null,"Axles","Unsprung mass (kg)","Curving Class","Loco-hauled or MU?"]
[null,null,null,null,"Maximum","Operating (calc.)","Operating (from timetable)","Operating"]
[null,"25/3",4139.7700000000004,74,90,46.128994258700871,null,{"$f":"IF(G4=\"\",F4,G4)","v":46.128994258700871},4,3500,"Loco2_50","N",null,1,{"$f":"IF(N4=1,\"N\",\"Y\")","v":"N"}]
[null,"31/1",691.75,107,90,46.128994258700871,null,{"$f":"IF(G5=\"\",F5,G5)","v":46.128994258700871},6,3370,"Loco3_50","N",null,1,{"$f":"IF(N5=1,\"N\",\"Y\")","v":"N"}]
[null,"33/2",1805.69,76,85,41.833640283865392,null,41.833640283865392,4,3500,"Loco2_50","N",null,1,"N"]
[null,"37/4",364.3,107,80,37.71404999857257,null,37.71404999857257,6,3556,"Loco3_50","N",null,1,"N"]
[null,"43/0",9378805.7400000002,73.25,125,80.897558916848965,71.19,71.19,4,2200,"Loco2_50","N",null,1,"N"]
[null,"47/4",41953.54,121,95,50.597220470834927,null,50.597220470834927,6,3600,"Loco3_50","N",null,1,"N"]
[null,"47/7",16441.53,119,95,50.597220470834927,null,50.597220470834927,6,3600,"Loco3_50","N",null,1,"N"]
[null,"57/0",2218.4499999999998,117,95,50.597220470834927,null,50.597220470834927,6,3487,"Loco3_50","N",null,1,"N"]
[null,"57/3",106113.03,117,95,50.597220470834927,null,50.597220470834927,6,3600,"Loco3_50","N",null,1,"N"]
[null,"57/6",238662.73,117,95,50.597220470834927,null,50.597220470834927,6,3600,"Loco3_50","N",null,1,"N"]
[null,"67/0",174692.48000000001,90,125,80.897558916848965,null,80.897558916848965,4,2100,"Loco2_50","N",null,1,"N"]
[null,"67/0 (110)",0,90,110,65.013086750025309,null,65.013086750025309,4,2100,"Loco2_50","N","TfW request for Route Based Speed following industry consultation - final clarification email ",1,"N"]
[null,"68/0",674773.13,86,100,55.235627829803029,null,55.235627829803029,4,2664,"Class_68","N",null,1,"N"]
[null,"73/2",1607.34,75,90,46.128994258700871,null,46.128994258700871,4,3302,"Loco2_50","N",null,1,"N"]
[null,"73/9",310832.58,76.5,90,46.128994258700871,null,46.128994258700871,4,3200,"Loco2_50","N",null,1,"N"]
[null,"90/0",2841.81,84,110,65.013086750025309,null,65.013086750025309,4,2700,"Loco2_50","N",null,1,"N"]
[null,"91/1",916614.78,84,125,80.897558916848965,null,80.897558916848965,4,1740,"Loco2_50","N",null,1,"N"]
[null,"92/0",553018.16,126,87,43.530856943341377,null,43.530856943341377,6,3100,"Loco3_50","N",null,1,"N"]
[null,"98/4",5541.26,60,45,14.09979158752847,null,14.09979158752847,3,1338,"Loco3_50","N",null,1,"N"]
[null,"98/5",56117.54,125,75,33.773343344527987,null,33.773343344527987,6,1338,"Loco3_50","N",null,1,"N"]
[null,"98/8",26081.21,150,75,33.773343344527987,null,33.773343344527987,7,1338,"Loco3_50","N",null,1,"N"]
[null,1,1196103.4599999995,42,75,33.773343344527987,null,33.773343344527987,4,1700,"Coach_8","Y",null,0.89,"Y"]
[null,2,410791.42,35.162500000000001,100,55.235627829803029,null,55.235627829803029,4,1260,"Coach_12_40","Y",null,0.89,"Y"]
[null,3,23919923.68,38.22,125,80.897558916848965,null,80.897558916848965,4,1260,"Coach_16_40","Y",null,0.89,"Y"]
[null,"3 (100)",0,39.457500000000003,100,55.235627829803029,null,55.235627829803029,4,1260,"Coach_16_40","Y","Source VUC Calculator - TABS",0.89,"Y"]
[null,4,348269.04000000004,42.35,125,80.897558916848965,null,80.897558916848965,4,1860,"Coach_60_50","Y",null,0.89,"Y"]
[null,"4 (110)",0,42.35,110,65.013086750025309,null,65.013086750025309,4,1860,"Coach_60_50","Y","TfW request for Route Based Speed following industry consultation - final clarification email ",0.89,"Y"]
[null,"4A",8320649.4599999981,42.35,125,80.897558916848965,null,80.897558916848965,4,1860,"Coach_HB_50","Y",null,0.89,"Y"]
[null,5,8830266.6999999993,36.084400000000002,110,65.013086750025309,null,65.013086750025309,4,1199,"Coach_5","Y",null,0.89,"Y"]
[null,"5A",2154465.6,34.404499999999999,100,55.235627829803029,null,55.235627829803029,4,1183,"Coach_5A","Y",null,0.89,"Y"]
[null,"V",0,43.7,100,55.235627829803029,null,55.235627829803029,4,1500,"Coach_80_50","Y",null,0.89,"Y"]
[null,"VA",202313.77,48.5,100,55.235627829803029,null,55.235627829803029,4,1500,"Coach_80_50","Y",null,0.89,"Y"]
[null,"W",38606.57,43.5,140,98.197003575117208,null,98.197003575117208,4,1500,"Coach_80_50","Y",null,0.89,"Y"]
[null,"WA",1030577.45,43.5,125,80.897558916848965,null,80.897558916848965,4,1500,"Coach_HB_50","Y",null,0.89,"Y"]
[null,"121/M",0,40.4375,75,33.773343344527987,null,33.773343344527987,4,2000,"Coach_12_40","Y",null,0.89,"Y"]
[null,"139/M",44232.54,13.362500000000001,45,14.09979158752847,null,14.09979158752847,2,978,"PPM_2axle","Y",null,0.89,"Y"]
[null,"142/M",122626.34,27.212499999999999,75,33.773343344527987,null,33.773343344527987,2,1900,"Pacer_10","Y",null,0.89,"Y"]
[null,"143/M",183901.44,26.324999999999999,75,33.773343344527987,null,33.773343344527987,2,1900,"Pacer_10","Y",null,0.89,"Y"]
[null,"144/M",16758.62,26.324999999999999,75,33.773343344527987,null,33.773343344527987,2,1900,"Pacer_10","Y",null,0.89,"Y"]
[null,"150/M",25050770.030000001,40.6875,75,33.773343344527987,null,33.773343344527987,4,1300,"Coach_12_40","Y",null,0.89,"Y"]
[null,"153/M",2495377.66,43.9,75,33.773343344527987,null,33.773343344527987,4,1300,"Coach_12_40","Y",null,0.89,"Y"]
[null,"155/M",1374939.48,42.4,75,33.773343344527987,null,33.773343344527987,4,1300,"Coach_12_40","Y",null,0.89,"Y"]
[null,"156/M",21464950.93,41.5625,75,33.773343344527987,null,33.773343344527987,4,1300,"Coach_12_40","Y",null,0.89,"Y"]
[null,"158/M",41585079.270000003,41.225000000000001,90,46.128994258700871,null,46.128994258700871,4,1924,"Coach_12_40","Y",null,0.89,"Y"]
[null,"159/M",14234914.710000001,41.2,90,46.128994258700871,null,46.128994258700871,4,1924,"Coach_12_40","Y",null,0.89,"Y"]
[null,"165/M",19230423.850000001,40.674999999999997,75,33.773343344527987,null,33.773343344527987,4,1924,"Coach_12_40","Y",null,0.89,"Y"]
[null,"166/M",7697663.6100000003,42.15,75,33.773343344527987,null,33.773343344527987,4,1924,"Coach_12_40","Y",null,0.89,"Y"]
[null,"168/3/M",0,50.90625,100,55.235627829803029,null,55.235627829803029,4,2185,"Coach_12_40","Y",null,0.89,"Y"]
[null,"168/M",12664985.630000001,47.412500000000001,100,55.235627829803029,null,55.235627829803029,4,2185,"Coach_12_40","Y",null,0.89,"Y"]
[null,"170/M",37225579.229999997,46.024999999999999,100,55.235627829803029,null,55.235627829803029,4,1553,"Coach_12_50","Y",null,0.89,"Y"]
[null,"171/M",4916373.1900000004,49.7,100,55.235627829803029,null,55.235627829803029,4,1553,"Coach_12_50","Y",null,0.89,"Y"]
[null,"172/M",8139952.1900000004,42.8,100,55.235627829803029,33.4,33.4,4,1331,"Coach_8","Y",null,0.89,"Y"]
[null,"175/M",11759636.960000001,53.1,100,55.235627829803029,null,55.235627829803029,4,1824,"Coach_50_50","Y",null,0.89,"Y"]
[null,"180/M",8827207.6300000008,53.5,125,80.897558916848965,null,80.897558916848965,4,1879,"Coach_50_50","Y",null,0.89,"Y"]
[null,"185/M",525709.19999999995,55.8,100,55.235627829803029,null,55.235627829803029,4,1833,"Coach_24_50","Y",null,0.89,"Y"]
[null,"185HB/M",23255437.199999999,55.5,100,55.235627829803029,null,55.235627829803029,4,1833,"185HB/M","Y",null,0.89,"Y"]
[null,"195/M",16959214.440000001,44.954999999999998,100,55.235627829803029,null,55.235627829803029,4,1493.75,"Cl_195/M","Y",null,0.89,"Y"]
[null,"196/0/M",39166.18,45.912500000000001,100,55.235627829803029,null,55.235627829803029,4,1493.75,"Cl_196/0/M","Y",null,0.89,"Y"]
[null,"196/1/M",58908.959999999999,45.05,100,55.235627829803029,null,55.235627829803029,4,1493.75,"Cl_196/1/M","Y",null,0.89,"Y"]
[null,"220/M",31584721.280000001,50.98,125,80.897558916848965,68.709999999999994,68.709999999999994,4,1338,"Coach_26_50","Y","Operating Weight changed as per correspondence and data provided by XC (50.98t taken from their spreadsheet).",0.89,"Y"]
[null,"221/M",269001.71999999997,58.65,125,80.897558916848965,68.709999999999994,68.709999999999994,4,1830,"Coach_48_60","Y",null,0.89,"Y"]
[null,"221HB/M",41656211.759999998,58.65,125,80.897558916848965,68.709999999999994,68.709999999999994,4,1830,"Coach_HB_Cl221","Y",null,0.89,"Y"]
[null,"221HB/TR/M",0,55.48,125,80.897558916848965,68.709999999999994,68.709999999999994,4,1830,"Coach_HB_Cl221","Y","New VUC rate for 221s with Tilt Removed (TR)  - Operating Weight  as per VUC calculator",0.89,"Y"]
[null,"222/M",37288461.640000001,50.875,125,80.897558916848965,null,80.897558916848965,4,1375,"Coach_26_50","Y",null,0.89,"Y"]
[null,"230/M",130395.4,33.686,60,23.059927252736532,30.57,30.57,4,1688,"Coach_35_50","Y",null,0.89,"Y"]
[null,"230/T",14338.66,22.748999999999999,60,23.059927252736532,30.57,{"$f":"IF(G69=\"\",F69,G69)","v":30.57},4,1188,"Coach_35_50","Y",null,0.89,{"$f":"IF(N69=1,\"N\",\"Y\")","v":"Y"}]
[null,"313/M",2352829.7400000002,38.774999999999999,75,33.773343344527987,null,33.773343344527987,4,2000,"Coach_17_40","Y",null,0.89,"Y"]
[null,"313/T",1176414.8700000001,34.112499999999997,75,33.773343344527987,null,33.773343344527987,4,1340,"Coach_17_40","Y",null,0.89,"Y"]
[null,"314/M",5096.82,37.049999999999997,75,33.773343344527987,null,33.773343344527987,4,2000,"Coach_17_40","Y",null,0.89,"Y"]
[null,"314/T",2548.41,35.85,75,33.773343344527987,null,33.773343344527987,4,1340,"Coach_17_40","Y",null,0.89,"Y"]
[null,"315/M",615547.42000000004,40.575000000000003,75,33.773343344527987,null,33.773343344527987,4,2000,"Coach_17_40","Y",null,0.89,"Y"]
[null,"315/T",615547.42000000004,29.625,75,33.773343344527987,null,33.773343344527987,4,1260,"Coach_17_30","Y",null,0.89,"Y"]
[null,"317/M",2100041.83,51.662500000000001,100,55.235627829803029,null,55.235627829803029,4,2870,"Coach_35_50","Y",null,0.89,"Y"]
[null,"317/T",6300125.4900000002,31.9,100,55.235627829803029,null,55.235627829803029,4,1300,"Coach_17_30","Y",null,0.89,"Y"]
[null,"318/M",1636666.77,53.862499999999997,90,46.128994258700871,null,46.128994258700871,4,2900,"Coach_35_50","Y",null,0.89,"Y"]
[null,"318/T",3273333.54,32.475000000000001,90,46.128994258700871,null,46.128994258700871,4,1300,"Coach_17_30","Y",null,0.89,"Y"]
[null,"319/M",1272150.42,53.5625,100,55.235627829803029,null,55.235627829803029,4,2975,"Coach_35_50","Y",null,0.89,"Y"]
[null,"319/T",3816451.26,31.625,100,55.235627829803029,null,55.235627829803029,4,1225,"Coach_17_30","Y",null,0.89,"Y"]
[null,"320/M",2720444.19,55.024999999999999,90,46.128994258700871,null,46.128994258700871,4,2975,"Coach_15_60","Y",null,0.89,"Y"]
[null,"320/T",5440888.3799999999,39.012500000000003,90,46.128994258700871,null,46.128994258700871,4,1225,"Coach_15_30","Y",null,0.89,"Y"]
[null,"321/M",5273886.37,54.0625,100,55.235627829803029,null,55.235627829803029,4,2975,"Coach_15_60","Y",null,0.89,"Y"]
[null,"321/T",15821659.109999999,32.1875,100,55.235627829803029,null,55.235627829803029,4,1225,"Coach_15_30","Y",null,0.89,"Y"]
[null,"322/M",542025.72,56.412500000000001,100,55.235627829803029,null,55.235627829803029,4,2975,"Coach_15_60","Y",null,0.89,"Y"]
[null,"322/T",1626077.16,33.837499999999999,100,55.235627829803029,null,55.235627829803029,4,1225,"Coach_15_30","Y",null,0.89,"Y"]
[null,"323/M",7863172.4800000004,42.774999999999999,75,33.773343344527987,null,33.773343344527987,4,1700,"Coach_15_40","Y",null,0.89,"Y"]
[null,"323/T",3931586.24,39.799999999999997,75,33.773343344527987,null,33.773343344527987,4,1340,"Coach_15_40","Y",null,0.89,"Y"]
[null,"331/M",8849240,42.305,100,55.235627829803029,null,55.235627829803029,4,1450,"Cl_331/M","Y",null,0.89,"Y"]
[null,"331/T",5318313.03,35.39,100,55.235627829803029,null,55.235627829803029,4,1190,"Cl_ 331/T","Y",null,0.89,"Y"]
[null,"332/M",0,50.25,100,55.235627829803029,null,55.235627829803029,4,1639,"Coach_12_50","Y",null,0.89,"Y"]
[null,"332/T",0,49.0625,100,55.235627829803029,null,55.235627829803029,4,1577,"Coach_12_50","Y",null,0.89,"Y"]
[null,"333/M",2591080.08,53.975000000000001,100,55.235627829803029,null,55.235627829803029,4,1639,"Coach_12_50","Y",null,0.89,"Y"]
[null,"333/T",2591080.08,49.7,100,55.235627829803029,null,55.235627829803029,4,1577,"Coach_12_50","Y",null,0.89,"Y"]
[null,"334/M",7822809.4000000004,45,90,46.128994258700871,null,46.128994258700871,4,1765,"Coach_50_50","Y",null,0.89,"Y"]
[null,"334/T",3911404.7,41.462499999999999,90,46.128994258700871,null,46.128994258700871,4,1414,"Coach_50_40","Y",null,0.89,"Y"]
[null,"345/M FLU",31545901.949999999,37.978749999999998,90,46.128994258700871,null,46.128994258700871,4,1472,"Cl_345/M_FLU","Y",null,0.89,"Y"]
[null,"345/M RLU",5843228.46,39.524000000000001,90,46.128994258700871,null,46.128994258700871,4,1497,"Cl_345/M_RLU","Y",null,0.89,"Y"]
[null,"345/T",5023234.2,31.524999999999999,90,46.128994258700871,null,46.128994258700871,4,1079,"Cl_345/T","Y",null,0.89,"Y"]
[null,"350/1/M",10527605.640000001,50.49,110,65.013086750025309,null,65.013086750025309,4,1870,"Coach_24_50","Y",null,0.89,"Y"]
[null,"350/1/T",10328135.279999999,42.78,110,65.013086750025309,null,65.013086750025309,4,1550,"Coach_24_40","Y",null,0.89,"Y"]
[null,"350/2/M (110)",14152036.439999999,47.6,110,65.013086750025309,null,65.013086750025309,4,1760,"Coach_24_50","Y",null,0.89,"Y"]
[null,"350/2/T (110)",14152036.439999999,42.54,110,65.013086750025309,null,65.013086750025309,4,1548,"Coach_24_40","Y",null,0.89,"Y"]
[null,"350/3/4/M",7523955.7800000003,46.74,110,65.013086750025309,null,65.013086750025309,4,1760,"Coach_24_50","Y",null,0.89,"Y"]
[null,"350/3/4/T",7723426.1399999997,42.3,110,65.013086750025309,null,65.013086750025309,4,1550,"Coach_24_40","Y",null,0.89,"Y"]
[null,"357/3/M",0,42.197989999999997,100,55.235627829803029,null,55.235627829803029,4,1470,"Coach_12_40","Y",null,0.89,"Y"]
[null,"357/3/M (75)",4953265.74,42.197989999999997,75,33.773343344527987,null,33.773343344527987,4,1470,"Coach_12_40","Y",null,0.89,"Y"]
[null,"357/3/T",0,41.728999999999999,100,55.235627829803029,null,55.235627829803029,4,1310,"Coach_12_40","Y",null,0.89,"Y"]
[null,"357/3/T (75)",1651088.58,41.728999999999999,75,33.773343344527987,null,33.773343344527987,4,1310,"Coach_12_40","Y",null,0.89,"Y"]
[null,"357/M",553631.09,43.662500000000001,100,55.235627829803029,null,55.235627829803029,4,1470,"Coach_12_40","Y",null,0.89,"Y"]
[null,"357/M (75)",16573674.48,43.662500000000001,75,33.773343344527987,null,33.773343344527987,4,1470,"Coach_12_40","Y",null,0.89,"Y"]
[null,"357/T",184811.08,44.174999999999997,100,55.235627829803029,null,55.235627829803029,4,1310,"Coach_12_40","Y",null,0.89,"Y"]
[null,"357/T (75)",5524558.1600000001,44.174999999999997,75,33.773343344527987,null,33.773343344527987,4,1310,"Coach_12_40","Y",null,0.89,"Y"]
[null,"360/M",5546205.6200000001,47.1875,100,55.235627829803029,null,55.235627829803029,4,1870,"Coach_24_50","Y",null,0.89,"Y"]
[null,"360/T",5520630.6600000001,42.15,100,55.235627829803029,null,55.235627829803029,4,1550,"Coach_24_40","Y",null,0.89,"Y"]
[null,"365/M",43651.64,44.25,100,55.235627829803029,null,55.235627829803029,4,2000,"Coach_12_40","Y",null,0.89,"Y"]
[null,"365/T",43651.64,37.15,100,55.235627829803029,null,55.235627829803029,4,1400,"Coach_12_30","Y",null,0.89,"Y"]
[null,"373/M",3459008.04,59.2,100,55.235627829803029,null,55.235627829803029,3.5,2140,"Loco2_50","Y",null,0.89,"Y"]
[null,"373/T",31131072.359999999,32.299999999999997,100,55.235627829803029,null,55.235627829803029,2.1,2043.0000000000002,"Artic2_80","Y",null,0.89,"Y"]
[null,"375/M",39875905.509999998,46.162500000000001,100,55.235627829803029,null,55.235627829803029,4,1470,"Coach_12_50","Y",null,0.89,"Y"]
[null,"375/T",13605485.720000001,37.8125,100,55.235627829803029,null,55.235627829803029,4,1325,"Coach_12_40","Y",null,0.89,"Y"]
[null,"376/M",9065530.8599999994,43.45,75,33.773343344527987,null,33.773343344527987,4,1473,"Coach_12_40","Y",null,0.89,"Y"]
[null,"376/T",2266386.2400000002,38.1,75,33.773343344527987,null,33.773343344527987,4,1325,"Coach_12_40","Y",null,0.89,"Y"]
[null,"377/M",72287497.599999994,44.6,100,55.235627829803029,null,55.235627829803029,4,1257,"Coach_12_50","Y",null,0.89,"Y"]
[null,"377/T",23964639.100000001,39.5,100,55.235627829803029,null,55.235627829803029,4,1093,"Coach_12_40","Y",null,0.89,"Y"]
[null,"378/M",10217171.26,43.41,75,33.773343344527987,null,33.773343344527987,4,1645,"Coach_12_50","Y",null,0.89,"Y"]
[null,"378/T",2630263.44,38.76,75,33.773343344527987,null,33.773343344527987,4,1435,"Coach_12_40","Y",null,0.89,"Y"]
[null,"379/M",8169288.8999999994,44.2,100,55.235627829803029,null,55.235627829803029,4,1559,"Coach_12_50","Y",null,0.89,"Y"]
[null,"379/T",2723096.3,43.68,100,55.235627829803029,null,55.235627829803029,4,1425,"Coach_12_50","Y",null,0.89,"Y"]
[null,"380/M",7635549.4000000004,47.725000000000001,100,55.235627829803029,null,55.235627829803029,4,1916,"Coach_24_50","Y",null,0.89,"Y"]
[null,"380/T",5310090.82,44.987499999999997,100,55.235627829803029,null,55.235627829803029,4,1548,"Coach_17_40","Y",null,0.89,"Y"]
[null,"385/M",14419194.890000001,45.68,100,55.235627829803029,null,{"$f":"IF(G133=\"\",F133,G133)","v":55.235627829803029},4,1530,"Cl_385/M","Y",null,0.89,{"$f":"IF(N133=1,\"N\",\"Y\")","v":"Y"}]
[null,"385/T",10090455.289999999,39.9,100,55.235627829803029,null,{"$f":"IF(G134=\"\",F134,G134)","v":55.235627829803029},4,1320,"Cl_385/T","Y",null,0.89,"Y"]
[null,"387/M",33689821.229999997,46.612499999999997,110,65.013086750025309,null,{"$f":"IF(G135=\"\",F135,G135)","v":65.013086750025309},4,1588,"Coach_12_50","Y",null,0.89,"Y"]
[null,"387/M (75)",732467.73,46.612499999999997,75,33.773343344527987,null,{"$f":"IF(G136=\"\",F136,G136)","v":33.773343344527987},4,1588,"Coach_12_50","Y",null,0.89,"Y"]
[null,"387/T",11383008.189999999,43.287500000000001,110,65.013086750025309,null,{"$f":"IF(G137=\"\",F137,G137)","v":65.013086750025309},4,1407,"Coach_12_40","Y",null,0.89,"Y"]
[null,"387/T (75)",155795.03,43.287500000000001,75,33.773343344527987,null,{"$f":"IF(G138=\"\",F138,G138)","v":33.773343344527987},4,1407,"Coach_12_40","Y",null,0.89,"Y"]
[null,"390/M",390377.49,54.38,125,80.897558916848965,null,80.897558916848965,4,1835,"Tilting_50_50","Y",null,0.89,"Y"]
[null,"390/T",216586.59,52.06,125,80.897558916848965,null,80.897558916848965,4,1699,"Tilting_50_50","Y",null,0.89,"Y"]
[null,"390HB/M",94096544.590000004,54.38,125,80.897558916848965,null,80.897558916848965,4,1835,"Cl_390/HB/M","Y",null,0.89,"Y"]
[null,"390HB/T",51564393.399999999,52.06,125,80.897558916848965,null,80.897558916848965,4,1699,"Cl_390/HB/T","Y",null,0.89,"Y"]
[null,"395/M",20242850.640000001,47.475000000000001,100,55.235627829803029,null,55.235627829803029,4,1979,"Coach_16_50","Y",null,0.89,"Y"]
[null,"395/T",10121446.779999999,47.75,100,55.235627829803029,null,55.235627829803029,4,1724,"Coach_16_50","Y",null,0.89,"Y"]
[null,"397/M",5717629.2599999998,40.547499999999999,110,65.013086750025309,null,65.013086750025309,4,1488,"Cl_397/M","Y",null,0.89,"Y"]
[null,"397/T",3811752.84,38.15,110,65.013086750025309,null,65.013086750025309,4,1235.5,"Cl_ 397/T","Y",null,0.89,"Y"]
[null,"399/0",583130.28,21.7,62.15,24.49083724128467,null,24.49083724128467,2.67,818,"Cl_399/0","Y","Nick Prag 15.11.23 email",0.89,"Y"]
[null,"442/M",0,56.95,100,55.235627829803029,null,55.235627829803029,4,3230,"Coach_12_50","Y",null,0.89,"Y"]
[null,"442/T",0,41.274999999999999,100,55.235627829803029,null,55.235627829803029,4,1325,"Coach_12_40","Y",null,0.89,"Y"]
[null,"444HB/M",14803836.52,54.4,100,55.235627829803029,null,55.235627829803029,4,1840,"Coach_HB_60","Y",null,0.89,"Y"]
[null,"444HB/T",22205455.329999998,42.82,100,55.235627829803029,null,55.235627829803029,4,1510,"Coach_HB_50","Y",null,0.89,"Y"]
[null,"450/M",277061.62,51.21,100,55.235627829803029,null,55.235627829803029,4,1920,"Coach_24_50","Y",null,0.89,"Y"]
[null,"450/T",277108.53999999998,40.61,100,55.235627829803029,null,55.235627829803029,4,1550,"Coach_24_40","Y",null,0.89,"Y"]
[null,"450HB/M",29886623.379999999,51.21,100,55.235627829803029,null,55.235627829803029,4,1920,"Coach_HB_50","Y",null,0.89,"Y"]
[null,"450HB/T",29886623.379999999,40.61,100,55.235627829803029,null,55.235627829803029,4,1550,"Coach_HB_40","Y",null,0.89,"Y"]
[null,"455/M/AC",0,50.576000000000001,75,33.773343344527987,null,33.773343344527987,4,2432,"Coach_35_50","Y","Characteristics are for the AC variant of 455s, introduced as a supplement during CP6 (note, supplements list omits 'AC' suffix, meaning that supplements name is identical to PR18 name). All vehicles have been converted to the AC variant.",0.89,"Y"]
[null,"455/T/AC",0,32.429000000000002,75,33.773343344527987,null,33.773343344527987,4,1260,"Coach_17_30","Y","Characteristics are for the AC variant of 455s, introduced as a supplement during CP6 (note, supplements list omits 'AC' suffix, meaning that supplements name is identical to PR18 name). All vehicles have been converted to the AC variant.",0.89,"Y"]
[null,"456/M",1191015.04,44.0625,75,33.773343344527987,null,33.773343344527987,4,3000,"Coach_12_40","Y",null,0.89,"Y"]
[null,"456/T",1191015.04,33.3125,75,33.773343344527987,null,33.773343344527987,4,1260,"Coach_12_30","Y",null,0.89,"Y"]
[null,"458/5/M",6768488.9800000004,45.497500000000002,75,33.773343344527987,null,33.773343344527987,4,1662,"Coach_80_50","Y",null,0.89,"Y"]
[null,"458/5/T",4552891.12,36.24,75,33.773343344527987,null,33.773343344527987,4,1438,"Coach_80_40","Y",null,0.89,"Y"]
[null,"458/M",73212.98,47.63,75,33.773343344527987,null,33.773343344527987,4,1662,"Coach_80_50","Y",null,0.89,"Y"]
[null,"458/T",4121.76,38.04,75,33.773343344527987,null,33.773343344527987,4,1438,"Coach_80_40","Y",null,0.89,"Y"]
[null,"465/M",19854925.120000001,42.2,75,33.773343344527987,null,33.773343344527987,4,2000,"Coach_15_40","Y",null,0.89,"Y"]
[null,"465/T",19854925.120000001,32.875,75,33.773343344527987,null,33.773343344527987,4,1239,"Coach_15_30","Y",null,0.89,"Y"]
[null,"466/M",2169971.13,43.825000000000003,75,33.773343344527987,null,33.773343344527987,4,3000,"Coach_15_40","Y",null,0.89,"Y"]
[null,"466/T",2169971.13,34.475000000000001,75,33.773343344527987,null,33.773343344527987,4,1250,"Coach_15_30","Y",null,0.89,"Y"]
[null,"507/M",4719640.4000000004,40.85,75,33.773343344527987,null,33.773343344527987,4,3000,"Coach_17_40","Y",null,0.89,"Y"]
[null,"507/T",2359820.2000000002,30.2,75,33.773343344527987,null,33.773343344527987,4,1260,"Coach_17_30","Y",null,0.89,"Y"]
[null,"508/M",4321217.68,40.299999999999997,75,33.773343344527987,null,33.773343344527987,4,3000,"Coach_17_40","Y",null,0.89,"Y"]
[null,"508/T",2160608.84,31.6,75,33.773343344527987,null,33.773343344527987,4,1260,"Coach_17_30","Y",null,0.89,"Y"]
[null,"700/M",76993965.849999994,39.06,100,55.235627829803029,null,55.235627829803029,4,1282,"Cl_700/M","Y","User defined' Tgamma values provided for CP7. Mark Burstow approved on 16.03.23",0.89,"Y"]
[null,"700/T",76993886.299999997,32.622500000000002,100,55.235627829803029,null,55.235627829803029,4,1160,"Cl_ 700/T","Y","User defined' Tgamma values provided for CP7. Mark Burstow approved on 16.03.23",0.89,"Y"]
[null,"701/T",0,29.224,100,55.235627829803029,null,55.235627829803029,4,971,"Cl_701/T","Y","Consented to in July 2023 but never added to the published supplements list. ",0.89,"Y"]
[null,"701/0/M1",0,40.125,100,55.235627829803029,null,null,4,1287,"Cl_701/0/M1","Y","Consented to in July 2023 but never added to the published supplements list. ",0.89,"Y"]
[null,"701/0/M2",0,31.335000000000001,100,55.235627829803029,null,null,4,1265,"Cl_701/0/M2","Y","Consented to in July 2023 but never added to the published supplements list. ",0.89,"Y"]
[null,"701/5/M1",0,41.631,100,55.235627829803029,null,null,4,1290,"Cl_701/5/M1","Y","Consented to in July 2023 but never added to the published supplements list. ",0.89,"Y"]
[null,"701/5/M2",0,31.484999999999999,100,55.235627829803029,null,null,4,1265,"Cl_701/5/M2","Y","Consented to in July 2023 but never added to the published supplements list. ",0.89,"Y"]
[null,"707/M",4105934.5399999996,39.686999999999998,100,55.235627829803029,null,null,4,1325,"Cl_707/M","Y",null,0.89,"Y"]
[null,"707/T",6158901.8099999996,30.368500000000001,100,55.235627829803029,null,null,4,1211,"Cl_707/T","Y",null,0.89,"Y"]
[null,"710/1/M",0,37.178879999999999,75,33.773343344527987,null,null,4,1375,"Coach_8","Y","Source VUC Calculator - TABS",0.89,"Y"]
[null,"710/2/M",0,38.688879999999997,75,33.773343344527987,null,null,4,1377.1899999999998,"Coach_8","Y","Source VUC Calculator - TABS",0.89,"Y"]
[null,"710/3/M",0,37.5105,75,33.773343344527987,null,null,4,1372.45,"Coach_8","Y","Source VUC Calculator - TABS",0.89,"Y"]
[null,"717/M",4943064.12,39.866999999999997,85,41.833640283865392,null,null,4,1309.33,"Cl_717/M","Y",null,0.89,"Y"]
[null,"717/T",4943064.12,32.879629999999999,85,41.833640283865392,null,null,4,1203,"Cl_717/T","Y",null,0.89,"Y"]
[null,"720/5/M",15660258.92,41.168799999999997,100,55.235627829803029,null,null,4,1373,"Cl_720/5/M","Y",null,0.89,"Y"]
[null,"720/5/T",3915064.73,37.521500000000003,100,55.235627829803029,null,null,4,992,"Cl_ 720/5/T","Y",null,0.89,"Y"]
[null,"745/0/M",7328400.6399999997,28.595500000000001,100,55.235627829803029,null,null,2,1956,"Coach_HB_60","Y",null,0.89,"Y"]
[null,"745/0/T",13818348.359999999,37.027999999999999,100,55.235627829803029,null,null,3.5,1356,"Coach_HB_40","Y",null,0.89,"Y"]
[null,"745/1/M",5142994.5999999996,28.2835,100,55.235627829803029,null,null,2,1956,"Coach_HB_60","Y",null,0.89,"Y"]
[null,"745/1/T",10897418.560000001,36.713500000000003,100,55.235627829803029,null,null,3.5,1356,"Coach_HB_40","Y",null,0.89,"Y"]
[null,"755/3/M",3162774.74,30.466999999999999,100,55.235627829803029,null,null,2,1956,"Coach_HB_60","Y",null,0.89,"Y"]
[null,"755/3/T",11330670.539999999,39.264000000000003,100,55.235627829803029,null,null,3,1359,"Coach_HB_50","Y",null,0.89,"Y"]
[null,"755/4/M",5391903.7300000004,30.734000000000002,100,55.235627829803029,null,null,2,1956,"Cl_755/4/M","Y","Curving class updated following agreement with ORR to apply user defined T-Gamma values  - 28.9.23",0.89,"Y"]
[null,"755/4/T",0,36.758000000000003,100,55.235627829803029,null,null,2.67,1359,"Cl_755/4/T","Y","Curving class updated following agreement with ORR to apply user defined T-Gamma values  - 28.9.23",0.89,"Y"]
[null,"769/M",604493.71,54.694499999999998,100,55.235627829803029,null,null,4,2975,"Coach_35_50","Y",null,0.89,"Y"]
[null,"769/T",1813481.13,39.074379999999998,100,55.235627829803029,null,null,4,1225,"Coach_17_30","Y",null,0.89,{"$f":"IF(N197=1,\"N\",\"Y\")","v":"Y"}]
[null,"777/M",0,34.652500000000003,75,33.773343344527987,null,null,3,1144,"Cl_777/M","Y","Consent notice dated 18.05.23",0.89,"Y"]
[null,"777/T",0,20.157499999999999,75,33.773343344527987,null,null,2,875,"Cl_ 777/T","Y","Consent notice dated 18.05.24",0.89,"Y"]
[null,"800/M FLU",38856481.530000001,54.2,125,80.897558916848965,null,null,4,1605,"Cl_800/M_FLU","Y",null,0.89,"Y"]
[null,"800/M RLU",17675087.129999999,54.52,125,80.897558916848965,null,null,4,1605,"Cl_800/M_RLU","Y",null,0.89,"Y"]
[null,"800/T FLU",30360615.969999999,42.95,125,80.897558916848965,null,null,4,1405,"Cl_ 800/T_FLU","Y",null,0.89,"Y"]
[null,"800/T RLU",11783391.42,51.075000000000003,125,80.897558916848965,null,null,4,1485,"Cl_ 800/T_RLU","Y",null,0.89,"Y"]
[null,"801/1/M",6246606.8099999996,49.55,125,80.897558916848965,null,null,4,1605,"Coach_16_50","Y",null,0.89,"Y"]
[null,"801/1/T",4164404.5399999996,50.7,125,80.897558916848965,null,null,4,1485,"Coach_16_50","Y",null,0.89,"Y"]
[null,"801/2/M",36765421.659999996,47.825000000000003,125,80.897558916848965,null,null,4,1605,"Coach_16_40","Y",null,0.89,"Y"]
[null,"801/2/T1",14695257.140000001,50.3,125,80.897558916848965,null,null,4,1485,"Coach_16_50","Y",null,0.89,"Y"]
[null,"801/2/T2",14717090.82,43.6,125,80.897558916848965,null,null,4,1405,"Coach_12_40","Y",null,0.89,"Y"]
[null,"802/M",6855832.2599999998,51.54,125,80.897558916848965,null,null,4,1605,"Cl_802/M","Y",null,0.89,"Y"]
[null,"802/M FLU",14367124.01,54.6,125,80.897558916848965,null,null,4,1605,"Cl_802/M_FLU","Y",null,0.89,"Y"]
[null,"802/M RLU",10191528.84,54.92,125,80.897558916848965,null,null,4,1605,"Cl_802/M_RLU","Y",null,0.89,"Y"]
[null,"802/T",4705702.32,44.6,125,80.897558916848965,null,null,4,1485,"Cl_ 802/T","Y",null,0.89,"Y"]
[null,"802/T FLU",10913238,50.781300000000002,125,80.897558916848965,null,null,4,1485,"Cl_ 802/T_FLU","Y",null,0.89,"Y"]
[null,"802/T RLU",6794352.5599999996,51.075000000000003,125,80.897558916848965,null,null,4,1485,"Cl_ 802/T_RLU","Y",null,0.89,"Y"]
[null,"803/M",0,47.722499999999997,125,80.897558916848965,null,null,4,1485,"Cl_803/M","Y","Source VUC Calculator",0.89,"Y"]
[null,"803/T",0,50.3125,125,80.897558916848965,null,null,4,1365,"Cl_ 803/T","Y","Source VUC Calculator",0.89,"Y"]